null
SMILES: Clc1cccc(N2CCCN(CCCOc3ccc4CCC(=O)Nc4c3)CC2)c1Cl
InChI Key: InChIKey=CWVVNHIKQCMQOH-UHFFFAOYSA-N
Activity Spreadsheet -- Enzyme Inhibition Constant Data from BindingDB
Found 4 hits for monomerid = 185677
Trg + Lig
Ki
nM
ΔG°
kcal/mole
IC50
nM
Kd
nM
EC50/IC50
nM
koff
s-1
kon
M-1s-1
pHTemp
°C
D(2) dopamine receptor
(Homo sapiens (Human))
BDBM185677
(UNC10000003 | US9156822, 1)
Show SMILES Clc1cccc(N2CCCN(CCCOc3ccc4CCC(=O)Nc4c3)CC2)c1Cl
Show InChI InChI=1S/C23H27Cl2N3O2/c24-19-4-1-5-21(23(19)25)28-12-2-10-27(13-14-28)11-3-15-30-18-8-6-17-7-9-22(29)26-20(17)16-18/h1,4-6,8,16H,2-3,7,9-15H2,(H,26,29)
Reactome pathway
US Patent
8.30n/an/an/an/an/an/a7.4n/a
The University of North Carolina at Chapel Hill
US Patent
Assay Description
Membranes prepared as above were resuspended to 1 ug protein/ul (measured by Bradford assay using BSA as standard), and 50 ul were added to each well...
US Patent US9156822 (2015)
BindingDB Entry DOI: 10.7270/Q2H41Q6D
D(2) dopamine receptor
(Homo sapiens (Human))
BDBM185677
(UNC10000003 | US9156822, 1)
Show SMILES Clc1cccc(N2CCCN(CCCOc3ccc4CCC(=O)Nc4c3)CC2)c1Cl
Show InChI InChI=1S/C23H27Cl2N3O2/c24-19-4-1-5-21(23(19)25)28-12-2-10-27(13-14-28)11-3-15-30-18-8-6-17-7-9-22(29)26-20(17)16-18/h1,4-6,8,16H,2-3,7,9-15H2,(H,26,29)
Reactome pathway
US Patent
n/an/an/an/a 3.10n/an/a7.4n/a
The University of North Carolina at Chapel Hill
US Patent
Assay Description
Recruitment of β-arrestin to agonist-stimulated D2 receptors was performed using a previously described Tango-type assay (Barnea et al., Proc. N...
US Patent US9156822 (2015)
BindingDB Entry DOI: 10.7270/Q2H41Q6D
D(2) dopamine receptor
(Homo sapiens (Human))
BDBM185677
(UNC10000003 | US9156822, 1)
Show SMILES Clc1cccc(N2CCCN(CCCOc3ccc4CCC(=O)Nc4c3)CC2)c1Cl
Show InChI InChI=1S/C23H27Cl2N3O2/c24-19-4-1-5-21(23(19)25)28-12-2-10-27(13-14-28)11-3-15-30-18-8-6-17-7-9-22(29)26-20(17)16-18/h1,4-6,8,16H,2-3,7,9-15H2,(H,26,29)
Reactome pathway
US Patent
n/an/an/an/a 6n/an/an/an/a
The University of North Carolina at Chapel Hill
US Patent
Assay Description
Cell Culture: Chinese Hamster Ovary (CHO) cells stably expressing the hD2L dopamine receptor (Urban et al., Neuropsychopharmacology 32:67 (2007)) wer...
US Patent US9156822 (2015)
BindingDB Entry DOI: 10.7270/Q2H41Q6D
D(2) dopamine receptor
(Homo sapiens (Human))
BDBM185677
(UNC10000003 | US9156822, 1)
Show SMILES Clc1cccc(N2CCCN(CCCOc3ccc4CCC(=O)Nc4c3)CC2)c1Cl
Show InChI InChI=1S/C23H27Cl2N3O2/c24-19-4-1-5-21(23(19)25)28-12-2-10-27(13-14-28)11-3-15-30-18-8-6-17-7-9-22(29)26-20(17)16-18/h1,4-6,8,16H,2-3,7,9-15H2,(H,26,29)
Reactome pathway
US Patent
n/an/an/an/a 6.10n/an/a7.4n/a
The University of North Carolina at Chapel Hill
US Patent
Assay Description
HEK293T cells co-expressing the cAMP biosensor GloSensor-22F (Promega) and hD2 receptors were seeded (10,000 cells/20 ul/well) into white, clear-bott...
US Patent US9156822 (2015)
BindingDB Entry DOI: 10.7270/Q2H41Q6D