BDBM185782 US9162991, 15o
SMILES: OB(C#N)c1cccc(\C=C\C(=O)n2nnc3ccccc23)c1
InChI Key: InChIKey=ZQAPWSOYERWRJX-CMDGGOBGSA-N
Data: 1 IC50
Activity Spreadsheet -- Enzyme Inhibition Constant Data from BindingDB
Found 1 hit for monomerid = 185782
Trg + Lig
Ki
nM
ΔG°
kcal/mole
IC50
nM
Kd
nM
EC50/IC50
nM
koff
s-1
kon
M-1s-1
pHTemp
°C
Protein-glutamine gamma-glutamyltransferase 2
(Cavia cutleri (Guinea pig))
BDBM185782
(US9162991, 15o)
Show SMILES OB(C#N)c1cccc(\C=C\C(=O)n2nnc3ccccc23)c1
Show InChI InChI=1S/C16H11BN4O2/c18-11-17(23)13-5-3-4-12(10-13)8-9-16(22)21-15-7-2-1-6-14(15)19-20-21/h1-10,23H/b9-8+
US Patent
n/an/a 3.90E+4n/an/an/an/an/an/a
University of Ottawa
US Patent
Assay Description
For enzymology studies of these compounds, recombinant guinea pig liver TGase was expressed in Escherichia coli and effectively purified (Gillet, S. ...
US Patent US9162991 (2015)
BindingDB Entry DOI: 10.7270/Q2VD6X8J