null
SMILES: O=C(Nc1ccc(\C=C\C(=O)n2onc3ccccc23)cc1)OCC1c2ccccc2-c2ccccc12
InChI Key:
Activity Spreadsheet -- Enzyme Inhibition Constant Data from BindingDB
Found 1 hit for monomerid = 185783
Trg + Lig
Ki
nM
ΔG°
kcal/mole
IC50
nM
Kd
nM
EC50/IC50
nM
koff
s-1
kon
M-1s-1
pHTemp
°C
Protein-glutamine gamma-glutamyltransferase 2
(Cavia cutleri (Guinea pig))
BDBM185783
(US9162991, 15p)
Show SMILES O=C(Nc1ccc(\C=C\C(=O)n2onc3ccccc23)cc1)OCC1c2ccccc2-c2ccccc12
US Patent
n/an/a 2.50E+4n/an/an/an/an/an/a
University of Ottawa
US Patent
Assay Description
For enzymology studies of these compounds, recombinant guinea pig liver TGase was expressed in Escherichia coli and effectively purified (Gillet, S. ...
US Patent US9162991 (2015)
BindingDB Entry DOI: 10.7270/Q2VD6X8J