BDBM185790 US9162991, 33a
SMILES: O=C(CCc1ccc(cc1)N(=O)=O)n1nnc2ccccc12
InChI Key: InChIKey=MRIPCODEPJIHCY-UHFFFAOYSA-N
Data: 1 IC50
Activity Spreadsheet -- Enzyme Inhibition Constant Data from BindingDB
Found 1 hit for monomerid = 185790
Trg + Lig
Ki
nM
ΔG°
kcal/mole
IC50
nM
Kd
nM
EC50/IC50
nM
koff
s-1
kon
M-1s-1
pHTemp
°C
Protein-glutamine gamma-glutamyltransferase 2
(Cavia cutleri (Guinea pig))
BDBM185790
(US9162991, 33a)
Show SMILES O=C(CCc1ccc(cc1)N(=O)=O)n1nnc2ccccc12
Show InChI InChI=1S/C15H12N4O3/c20-15(18-14-4-2-1-3-13(14)16-17-18)10-7-11-5-8-12(9-6-11)19(21)22/h1-6,8-9H,7,10H2
US Patent
n/an/a>2.00E+5n/an/an/an/an/an/a
University of Ottawa
US Patent
Assay Description
For enzymology studies of these compounds, recombinant guinea pig liver TGase was expressed in Escherichia coli and effectively purified (Gillet, S. ...
US Patent US9162991 (2015)
BindingDB Entry DOI: 10.7270/Q2VD6X8J