BDBM185802 US9163003, 10::USRE46942, Example 10
SMILES: Fc1ccc(cc1)C(=O)C1CCN(CC1)C1CCN(Cc2nc3CCOCc3c(=O)[nH]2)C1=O
InChI Key:
Data: 8 IC50
Activity Spreadsheet -- Enzyme Inhibition Constant Data from BindingDB
Found 8 hits for monomerid = 185802
Trg + Lig
Ki
nM
ΔG°
kcal/mole
IC50
nM
Kd
nM
EC50/IC50
nM
koff
s-1
kon
M-1s-1
pHTemp
°C
Poly [ADP-ribose] polymerase tankyrase-2
(Homo sapiens (Human))
BDBM185802
(US9163003, 10 | USRE46942, Example 10)
Show SMILES Fc1ccc(cc1)C(=O)C1CCN(CC1)C1CCN(Cc2nc3CCOCc3c(=O)[nH]2)C1=O
US Patent
n/an/a 6n/an/an/an/an/a25
NOVARTIS AG
US Patent
Assay Description
The human tankyrase 1 PARP catalytic domain, TNKS1P, was cloned into a pDONR221 vector using the Invitrogen Gateway Technology. This entry clone was ...
US Patent US9163003 (2015)
BindingDB Entry DOI: 10.7270/Q2QN65J6
Poly [ADP-ribose] polymerase tankyrase-1
(Homo sapiens (Human))
BDBM185802
(US9163003, 10 | USRE46942, Example 10)
Show SMILES Fc1ccc(cc1)C(=O)C1CCN(CC1)C1CCN(Cc2nc3CCOCc3c(=O)[nH]2)C1=O
US Patent
n/an/a 27n/an/an/an/an/a25
NOVARTIS AG
US Patent
Assay Description
The human tankyrase 1 PARP catalytic domain, TNKS1P, was cloned into a pDONR221 vector using the Invitrogen Gateway Technology. This entry clone was ...
US Patent US9163003 (2015)
BindingDB Entry DOI: 10.7270/Q2QN65J6
Poly [ADP-ribose] polymerase 1
(Homo sapiens (Human))
BDBM185802
(US9163003, 10 | USRE46942, Example 10)
Show SMILES Fc1ccc(cc1)C(=O)C1CCN(CC1)C1CCN(Cc2nc3CCOCc3c(=O)[nH]2)C1=O
US Patent
n/an/a 2.36E+4n/an/an/an/an/a25
NOVARTIS AG
US Patent
Assay Description
The human tankyrase 1 PARP catalytic domain, TNKS1P, was cloned into a pDONR221 vector using the Invitrogen Gateway Technology. This entry clone was ...
US Patent US9163003 (2015)
BindingDB Entry DOI: 10.7270/Q2QN65J6
Poly [ADP-ribose] polymerase 2
(Homo sapiens (Human))
BDBM185802
(US9163003, 10 | USRE46942, Example 10)
Show SMILES Fc1ccc(cc1)C(=O)C1CCN(CC1)C1CCN(Cc2nc3CCOCc3c(=O)[nH]2)C1=O
US Patent
n/an/a 9.20E+3n/an/an/an/an/an/a
Novartis AG
US Patent
Assay Description
The human tankyrase 1 PARP catalytic domain, TNKS1P, was cloned into a pDONR221 vector using the Invitrogen Gateway Technology. This entry clone was ...
US Patent USRE46942 (2018)
BindingDB Entry DOI: 10.7270/Q2VX0JVH
Poly [ADP-ribose] polymerase tankyrase-2
(Homo sapiens (Human))
BDBM185802
(US9163003, 10 | USRE46942, Example 10)
Show SMILES Fc1ccc(cc1)C(=O)C1CCN(CC1)C1CCN(Cc2nc3CCOCc3c(=O)[nH]2)C1=O
US Patent
n/an/a 6n/an/an/an/an/an/a
Novartis AG
US Patent
Assay Description
The human tankyrase 1 PARP catalytic domain, TNKS1P, was cloned into a pDONR221 vector using the Invitrogen Gateway Technology. This entry clone was ...
US Patent USRE46942 (2018)
BindingDB Entry DOI: 10.7270/Q2VX0JVH
Poly [ADP-ribose] polymerase tankyrase-1
(Homo sapiens (Human))
BDBM185802
(US9163003, 10 | USRE46942, Example 10)
Show SMILES Fc1ccc(cc1)C(=O)C1CCN(CC1)C1CCN(Cc2nc3CCOCc3c(=O)[nH]2)C1=O
US Patent
n/an/a 27n/an/an/an/an/an/a
Novartis AG
US Patent
Assay Description
The human tankyrase 1 PARP catalytic domain, TNKS1P, was cloned into a pDONR221 vector using the Invitrogen Gateway Technology. This entry clone was ...
US Patent USRE46942 (2018)
BindingDB Entry DOI: 10.7270/Q2VX0JVH
Poly [ADP-ribose] polymerase 1
(Homo sapiens (Human))
BDBM185802
(US9163003, 10 | USRE46942, Example 10)
Show SMILES Fc1ccc(cc1)C(=O)C1CCN(CC1)C1CCN(Cc2nc3CCOCc3c(=O)[nH]2)C1=O
US Patent
n/an/a 2.36E+4n/an/an/an/an/an/a
Novartis AG
US Patent
Assay Description
The human tankyrase 1 PARP catalytic domain, TNKS1P, was cloned into a pDONR221 vector using the Invitrogen Gateway Technology. This entry clone was ...
US Patent USRE46942 (2018)
BindingDB Entry DOI: 10.7270/Q2VX0JVH
Poly [ADP-ribose] polymerase 2
(Homo sapiens (Human))
BDBM185802
(US9163003, 10 | USRE46942, Example 10)
Show SMILES Fc1ccc(cc1)C(=O)C1CCN(CC1)C1CCN(Cc2nc3CCOCc3c(=O)[nH]2)C1=O
US Patent
n/an/a 9.20E+3n/an/an/an/an/a25
NOVARTIS AG
US Patent
Assay Description
The human tankyrase 1 PARP catalytic domain, TNKS1P, was cloned into a pDONR221 vector using the Invitrogen Gateway Technology. This entry clone was ...
US Patent US9163003 (2015)
BindingDB Entry DOI: 10.7270/Q2QN65J6