BDBM18582 6-[propyl(2,2,2-trifluoroethyl)amino]-4-(trifluoromethyl)-1,2-dihydroquinolin-2-one::6-bisalkylamino-2-quinolinone, 6g
SMILES: CCCN(CC(F)(F)F)c1ccc2[nH]c(=O)cc(c2c1)C(F)(F)F
InChI Key: InChIKey=CWFIGPZKUGSTDW-UHFFFAOYSA-N
Data: 1 KI  1 EC50
Activity Spreadsheet -- Enzyme Inhibition Constant Data from BindingDB
Found 1 hit for monomerid = 18582
Trg + Lig
Ki
nM
ΔG°
kcal/mole
IC50
nM
Kd
nM
EC50/IC50
nM
koff
s-1
kon
M-1s-1
pHTemp
°C
Androgen Receptor
(Homo sapiens (Human))
BDBM18582
(6-[propyl(2,2,2-trifluoroethyl)amino]-4-(trifluoro...)
Show SMILES CCCN(CC(F)(F)F)c1ccc2[nH]c(=O)cc(c2c1)C(F)(F)F
Show InChI InChI=1S/C15H14F6N2O/c1-2-5-23(8-14(16,17)18)9-3-4-12-10(6-9)11(15(19,20)21)7-13(24)22-12/h3-4,6-7H,2,5,8H2,1H3,(H,22,24)
NCI pathway
Reactome pathway
12 -11.2n/an/a 1.30n/an/a7.437
Ligand Pharmaceuticals Inc.
Assay Description
The compounds were evaluated in a transcriptional activation assay with hAR in a mammalian cell background (CV-1) as the primary in vitro assay. Rece...
Bioorg Med Chem Lett 17: 1527-31 (2007)
Article DOI: 10.1016/j.bmcl.2007.01.001
BindingDB Entry DOI: 10.7270/Q2XS5SP9