BDBM185840 US9163007, 89
SMILES: Nc1n[nH]c2ccc(cc12)-c1nnn(Cc2ccccc2)c1C1CC1
InChI Key: InChIKey=UOOFSEUSROQBBP-UHFFFAOYSA-N
Data: 1 KI
Activity Spreadsheet -- Enzyme Inhibition Constant Data from BindingDB
Found 1 hit for monomerid = 185840
Trg + Lig
Ki
nM
ΔG°
kcal/mole
IC50
nM
Kd
nM
EC50/IC50
nM
koff
s-1
kon
M-1s-1
pHTemp
°C
Cell division cycle 7-related protein kinase
(Homo sapiens (Human))
BDBM185840
(US9163007, 89)
Show SMILES Nc1n[nH]c2ccc(cc12)-c1nnn(Cc2ccccc2)c1C1CC1
Show InChI InChI=1S/C19H18N6/c20-19-15-10-14(8-9-16(15)21-23-19)17-18(13-6-7-13)25(24-22-17)11-12-4-2-1-3-5-12/h1-5,8-10,13H,6-7,11H2,(H3,20,21,23)
Reactome pathway
US Patent
35n/an/an/an/an/an/a7.5n/a
AbbVie Inc.
US Patent
Assay Description
11 data point. Cdc7 kinase assays were carried out in 25 mM HEPES, pH 7.5, 1 mM DTT, 10 mM MgCl2, 100 μM Na3VO4, and 0.075 mg/ml Triton X-100 u...
US Patent US9163007 (2015)
BindingDB Entry DOI: 10.7270/Q2KW5DTG