BDBM185871 US9163007, 227
SMILES: Clc1ccc(CNc2n[nH]c3ccc(cc23)-c2nnn(Cc3ccccc3)c2C2CC2)cc1
InChI Key: InChIKey=STFCLXQOOWSAJI-UHFFFAOYSA-N
Data: 1 KI
Activity Spreadsheet -- Enzyme Inhibition Constant Data from BindingDB
Found 1 hit for monomerid = 185871
Trg + Lig
Ki
nM
ΔG°
kcal/mole
IC50
nM
Kd
nM
EC50/IC50
nM
koff
s-1
kon
M-1s-1
pHTemp
°C
Cell division cycle 7-related protein kinase
(Homo sapiens (Human))
BDBM185871
(US9163007, 227)
Show SMILES Clc1ccc(CNc2n[nH]c3ccc(cc23)-c2nnn(Cc3ccccc3)c2C2CC2)cc1
Show InChI InChI=1S/C26H23ClN6/c27-21-11-6-17(7-12-21)15-28-26-22-14-20(10-13-23(22)29-31-26)24-25(19-8-9-19)33(32-30-24)16-18-4-2-1-3-5-18/h1-7,10-14,19H,8-9,15-16H2,(H2,28,29,31)
Reactome pathway
US Patent
15n/an/an/an/an/an/a7.5n/a
AbbVie Inc.
US Patent
Assay Description
11 data point. Cdc7 kinase assays were carried out in 25 mM HEPES, pH 7.5, 1 mM DTT, 10 mM MgCl2, 100 μM Na3VO4, and 0.075 mg/ml Triton X-100 u...
US Patent US9163007 (2015)
BindingDB Entry DOI: 10.7270/Q2KW5DTG