null
SMILES: FC(F)(F)CN(C(=O)C(F)(F)F)c1ccc2[nH]c(=O)cc(c2c1)C(F)(F)F
InChI Key: InChIKey=IHNWDWNUQKPNJK-UHFFFAOYSA-N
Activity Spreadsheet -- Enzyme Inhibition Constant Data from BindingDB
Found 1 hit for monomerid = 18597
Trg + Lig
Ki
nM
ΔG°
kcal/mole
IC50
nM
Kd
nM
EC50/IC50
nM
koff
s-1
kon
M-1s-1
pHTemp
°C
Androgen receptor
(Homo sapiens (Human))
BDBM18597
(2,2,2-trifluoro-N-[2-oxo-4-(trifluoromethyl)-1,2-d...)
Show SMILES FC(F)(F)CN(C(=O)C(F)(F)F)c1ccc2[nH]c(=O)cc(c2c1)C(F)(F)F
Show InChI InChI=1S/C14H7F9N2O2/c15-12(16,17)5-25(11(27)14(21,22)23)6-1-2-9-7(3-6)8(13(18,19)20)4-10(26)24-9/h1-4H,5H2,(H,24,26)
NCI pathway
Reactome pathway
1.00E+3n/a 4.10n/a 22n/an/an/an/a
Ligand Pharmaceuticals Inc.
Assay Description
The compounds were evaluated in a transcriptional activation assay with hAR in a mammalian cell background (CV-1) as the primary in vitro assay. Rece...
Bioorg Med Chem Lett 17: 1527-31 (2007)
Article DOI: 10.1016/j.bmcl.2007.01.001
BindingDB Entry DOI: 10.7270/Q2XS5SP9