null
SMILES: Oc1cc(O)cc(C\C(Cl)=C/Cc2cc(O)c(Cl)cc2O)c1
InChI Key: InChIKey=KAUKSUHQMCXCHC-BIIKFXOESA-N
Activity Spreadsheet -- Enzyme Inhibition Constant Data from BindingDB
Found 2 hits for monomerid = 186046
Trg + Lig
Ki
nM
ΔG°
kcal/mole
IC50
nM
Kd
nM
EC50/IC50
nM
koff
s-1
kon
M-1s-1
pHTemp
°C
Cell division protein FtsZ
(Escherichia coli)
BDBM186046
(US9169182, J24)
Show SMILES Oc1cc(O)cc(C\C(Cl)=C/Cc2cc(O)c(Cl)cc2O)c1
Show InChI InChI=1S/C16H14Cl2O4/c17-11(3-9-4-12(19)7-13(20)5-9)2-1-10-6-16(22)14(18)8-15(10)21/h2,4-8,19-22H,1,3H2/b11-2+
US Patent
n/an/a 1.60E+5n/an/an/an/a6.525
THE UNITED STATES OF AMERICA, AS REPRESENTED BY THE SECRETARY, DEPARTMENT OF HEALTH AND HUMAN SERVICES; UNIVERSITY OF PITTSBURGH-OF THE COMMONWEALTH SYSTEM OF HIGHER EDUCATION
US Patent
Assay Description
The bacterial cytoskeletal protein FtsZ is a GTPase and has structural homology to the eukaryotic cytoskeletal protein tubulin, but lacks significant...
US Patent US9169182 (2015)
BindingDB Entry DOI: 10.7270/Q22Z149Z
Cell division protein FtsZ
(Staphylococcus aureus)
BDBM186046
(US9169182, J24)
Show SMILES Oc1cc(O)cc(C\C(Cl)=C/Cc2cc(O)c(Cl)cc2O)c1
Show InChI InChI=1S/C16H14Cl2O4/c17-11(3-9-4-12(19)7-13(20)5-9)2-1-10-6-16(22)14(18)8-15(10)21/h2,4-8,19-22H,1,3H2/b11-2+
US Patent
n/an/a 8.80E+4n/an/an/an/a6.525
THE UNITED STATES OF AMERICA, AS REPRESENTED BY THE SECRETARY, DEPARTMENT OF HEALTH AND HUMAN SERVICES; UNIVERSITY OF PITTSBURGH-OF THE COMMONWEALTH SYSTEM OF HIGHER EDUCATION
US Patent
Assay Description
The bacterial cytoskeletal protein FtsZ is a GTPase and has structural homology to the eukaryotic cytoskeletal protein tubulin, but lacks significant...
US Patent US9169182 (2015)
BindingDB Entry DOI: 10.7270/Q22Z149Z