null
SMILES: COc1cc(=O)[nH]c2ccc(cc12)N(CC(F)(F)F)CC(F)(F)F
InChI Key: InChIKey=BTROHMUXWYCPAN-UHFFFAOYSA-N
Activity Spreadsheet -- Enzyme Inhibition Constant Data from BindingDB
Found 1 hit for monomerid = 18608
Trg + Lig
Ki
nM
ΔG°
kcal/mole
IC50
nM
Kd
nM
EC50/IC50
nM
koff
s-1
kon
M-1s-1
pHTemp
°C
Androgen receptor
(Homo sapiens (Human))
BDBM18608
(6-[bis(2,2,2-trifluoroethyl)amino]-4-methoxy-1,2-d...)
Show SMILES COc1cc(=O)[nH]c2ccc(cc12)N(CC(F)(F)F)CC(F)(F)F
Show InChI InChI=1S/C14H12F6N2O2/c1-24-11-5-12(23)21-10-3-2-8(4-9(10)11)22(6-13(15,16)17)7-14(18,19)20/h2-5H,6-7H2,1H3,(H,21,23)
NCI pathway
Reactome pathway
23n/a 15n/a 35n/an/an/an/a
Ligand Pharmaceuticals Inc.
Assay Description
The compounds were evaluated in a transcriptional activation assay with hAR in a mammalian cell background (CV-1) as the primary in vitro assay. Rece...
Bioorg Med Chem Lett 17: 1527-31 (2007)
Article DOI: 10.1016/j.bmcl.2007.01.001
BindingDB Entry DOI: 10.7270/Q2XS5SP9