BDBM18612 6-bisalkylamino-2-quinolinone, 8c::6-{[(2R)-1-chloropropan-2-yl](2,2,2-trifluoroethyl)amino}-4-(trifluoromethyl)-1,2-dihydroquinolin-2-one
SMILES: C[C@H](CCl)N(CC(F)(F)F)c1ccc2[nH]c(=O)cc(c2c1)C(F)(F)F
InChI Key: InChIKey=AUIQVMLZIOYPBH-MRVPVSSYSA-N
Data: 1 KI  1 EC50
Activity Spreadsheet -- Enzyme Inhibition Constant Data from BindingDB
Found 1 hit for monomerid = 18612
Trg + Lig
Ki
nM
ΔG°
kcal/mole
IC50
nM
Kd
nM
EC50/IC50
nM
koff
s-1
kon
M-1s-1
pHTemp
°C
Androgen Receptor
(Homo sapiens (Human))
BDBM18612
(6-bisalkylamino-2-quinolinone, 8c | 6-{[(2R)-1-chl...)
Show SMILES C[C@H](CCl)N(CC(F)(F)F)c1ccc2[nH]c(=O)cc(c2c1)C(F)(F)F |r|
Show InChI InChI=1S/C15H13ClF6N2O/c1-8(6-16)24(7-14(17,18)19)9-2-3-12-10(4-9)11(15(20,21)22)5-13(25)23-12/h2-5,8H,6-7H2,1H3,(H,23,25)/t8-/m1/s1
NCI pathway
Reactome pathway
5.40n/an/an/a 3.70n/an/an/an/a
Ligand Pharmaceuticals Inc.
Assay Description
The compounds were evaluated in a transcriptional activation assay with hAR in a mammalian cell background (CV-1) as the primary in vitro assay. Rece...
Bioorg Med Chem Lett 17: 1527-31 (2007)
Article DOI: 10.1016/j.bmcl.2007.01.001
BindingDB Entry DOI: 10.7270/Q2XS5SP9