BDBM18663 (2S)-3-(4-fluorophenoxy)-2-hydroxy-2-methyl-N-[4-nitro-3-(trifluoromethyl)phenyl]propanamide::BMC185567 S-1::CHEMBL124718::Nonsteroidal AR Ligand, S-5
SMILES: C[C@](O)(COc1ccc(F)cc1)C(=O)Nc1ccc(c(c1)C(F)(F)F)[N+]([O-])=O
InChI Key: InChIKey=KJMFOTCDISOHDX-INIZCTEOSA-N
Data: 3 KI
PDB links: 3 PDB IDs match this monomer.
Activity Spreadsheet -- Enzyme Inhibition Constant Data from BindingDB
Found 3 hits for monomerid = 18663
Trg + Lig
Ki
nM
ΔG°
kcal/mole
IC50
nM
Kd
nM
EC50/IC50
nM
koff
s-1
kon
M-1s-1
pHTemp
°C
Androgen receptor
(Rattus norvegicus (Rat))
BDBM18663
((2S)-3-(4-fluorophenoxy)-2-hydroxy-2-methyl-N-[4-n...)
Show SMILES C[C@](O)(COc1ccc(F)cc1)C(=O)Nc1ccc(c(c1)C(F)(F)F)[N+]([O-])=O |r|
Show InChI InChI=1S/C17H14F4N2O5/c1-16(25,9-28-12-5-2-10(18)3-6-12)15(24)22-11-4-7-14(23(26)27)13(8-11)17(19,20)21/h2-8,25H,9H2,1H3,(H,22,24)/t16-/m0/s1
Reactome pathway
6.10 -10.4n/an/an/an/an/a7.44
The Ohio State University
Assay Description
The Ki values were determined by the application of the Cheng-Prusoff equation: Ki = (IC50 x Kd)/(Kd+[L]) where [L] is the concentration of [3H]MIB (...
Bioorg Med Chem Lett 18: 5567-70 (2008)
Article DOI: 10.1016/j.bmcl.2008.09.002
BindingDB Entry DOI: 10.7270/Q2W0948B
3D
3D Structure (crystal)
Androgen Receptor
(Homo sapiens (Human))
BDBM18663
((2S)-3-(4-fluorophenoxy)-2-hydroxy-2-methyl-N-[4-n...)
Show SMILES C[C@](O)(COc1ccc(F)cc1)C(=O)Nc1ccc(c(c1)C(F)(F)F)[N+]([O-])=O |r|
Show InChI InChI=1S/C17H14F4N2O5/c1-16(25,9-28-12-5-2-10(18)3-6-12)15(24)22-11-4-7-14(23(26)27)13(8-11)17(19,20)21/h2-8,25H,9H2,1H3,(H,22,24)/t16-/m0/s1
NCI pathway
Reactome pathway
6.10n/an/an/an/an/an/an/an/a
GTx, Inc.
Curated by ChEMBL
Assay Description
Agonist activity at androgen receptor (unknown origin)
J Med Chem 52: 3597-617 (2009)
Article DOI: 10.1021/jm900280m
BindingDB Entry DOI: 10.7270/Q2GH9HWD
3D
3D Structure (crystal)
Androgen receptor
(Rattus norvegicus (Rat))
BDBM18663
((2S)-3-(4-fluorophenoxy)-2-hydroxy-2-methyl-N-[4-n...)
Show SMILES C[C@](O)(COc1ccc(F)cc1)C(=O)Nc1ccc(c(c1)C(F)(F)F)[N+]([O-])=O |r|
Show InChI InChI=1S/C17H14F4N2O5/c1-16(25,9-28-12-5-2-10(18)3-6-12)15(24)22-11-4-7-14(23(26)27)13(8-11)17(19,20)21/h2-8,25H,9H2,1H3,(H,22,24)/t16-/m0/s1
Reactome pathway
6.11 -10.4n/an/an/an/an/a7.44
University of Tennessee at Memphis
Assay Description
The Ki values were determined by the application of the Cheng-Prusoff equation: Ki = (IC50 x Kd)/(Kd+[L]) where [L] is the concentration of [3H]MIB (...
J Med Chem 47: 993-8 (2004)
Article DOI: 10.1021/jm030336u
BindingDB Entry DOI: 10.7270/Q2JH3JFB
3D
3D Structure (crystal)