BDBM18670 (2S)-2-hydroxy-3-(4-iodophenoxy)-2-methyl-N-[4-nitro-3-(trifluoromethyl)phenyl]propanamide::Nonsteroidal AR Ligand, S-11
SMILES: C[C@](O)(COc1ccc(I)cc1)C(=O)Nc1ccc(c(c1)C(F)(F)F)[N+]([O-])=O
InChI Key: InChIKey=PJANTQSJBUANIU-INIZCTEOSA-N
Data: 1 KI
Activity Spreadsheet -- Enzyme Inhibition Constant Data from BindingDB
Found 1 hit for monomerid = 18670
Trg + Lig
Ki
nM
ΔG°
kcal/mole
IC50
nM
Kd
nM
EC50/IC50
nM
koff
s-1
kon
M-1s-1
pHTemp
°C
Androgen receptor
(Rattus norvegicus (Rat))
BDBM18670
((2S)-2-hydroxy-3-(4-iodophenoxy)-2-methyl-N-[4-nit...)
Show SMILES C[C@](O)(COc1ccc(I)cc1)C(=O)Nc1ccc(c(c1)C(F)(F)F)[N+]([O-])=O |r|
Show InChI InChI=1S/C17H14F3IN2O5/c1-16(25,9-28-12-5-2-10(21)3-6-12)15(24)22-11-4-7-14(23(26)27)13(8-11)17(18,19)20/h2-8,25H,9H2,1H3,(H,22,24)/t16-/m0/s1
Reactome pathway
30.0 -9.53n/an/an/an/an/a7.44
University of Tennessee at Memphis
Assay Description
The Ki values were determined by the application of the Cheng-Prusoff equation: Ki = (IC50 x Kd)/(Kd+[L]) where [L] is the concentration of [3H]MIB (...
J Med Chem 47: 993-8 (2004)
Article DOI: 10.1021/jm030336u
BindingDB Entry DOI: 10.7270/Q2JH3JFB