BDBM187162 US9670181, 42 1-ethyl-6,7-dimethoxy-4-((6-methoxy-2-(propylamino)quinolin-3-yl)methyl)isoquinolin-3-ol
SMILES: CCCNc1nc2ccc(OC)cc2cc1Cc1c(O)nc(CC)c2cc(OC)c(OC)cc12
InChI Key: InChIKey=DBFADHJMUCFLPL-UHFFFAOYSA-N
Data: 1 IC50
Activity Spreadsheet -- Enzyme Inhibition Constant Data from BindingDB
Found 1 hit for monomerid = 187162
Trg + Lig
Ki
nM
ΔG°
kcal/mole
IC50
nM
Kd
nM
EC50/IC50
nM
koff
s-1
kon
M-1s-1
pHTemp
°C
cAMP and cAMP-inhibited cGMP 3',5'-cyclic phosphodiesterase 10A
(Homo sapiens (Human))
BDBM187162
(US9670181, 42 1-ethyl-6,7-dimethoxy-4-((6-methoxy-...)
Show SMILES CCCNc1nc2ccc(OC)cc2cc1Cc1c(O)nc(CC)c2cc(OC)c(OC)cc12
Show InChI InChI=1S/C27H31N3O4/c1-6-10-28-26-17(11-16-12-18(32-3)8-9-23(16)29-26)13-21-19-14-24(33-4)25(34-5)15-20(19)22(7-2)30-27(21)31/h8-9,11-12,14-15H,6-7,10,13H2,1-5H3,(H,28,29)(H,30,31)
Reactome pathway
US Patent
n/an/a 0.5n/an/an/an/a7.425
ALLERGAN, INC.; EXONHIT THERAPEUTICS SA
US Patent
Assay Description
The PDE assay is based on the homogenous time-resolved fluorescence resonance energy transfer (TR-FRET) technology (LANCE® from Perkin Elmer). This c...
US Patent US9670181 (2017)
BindingDB Entry DOI: 10.7270/Q21Z42KJ