BDBM187206 US9670181, 82 1-ethyl-4-((2-(ethylamino)-7-fluoro-6-methoxyquinolin-3-yl)methyl)-6,7-dimethoxyisoquinolin-3-ol
SMILES: CCNc1nc2cc(F)c(OC)cc2cc1Cc1c(O)nc(CC)c2cc(OC)c(OC)cc12
InChI Key: InChIKey=MNSIIAVQCFPATP-UHFFFAOYSA-N
Data: 1 IC50
Activity Spreadsheet -- Enzyme Inhibition Constant Data from BindingDB
Found 1 hit for monomerid = 187206
Trg + Lig
Ki
nM
ΔG°
kcal/mole
IC50
nM
Kd
nM
EC50/IC50
nM
koff
s-1
kon
M-1s-1
pHTemp
°C
cAMP and cAMP-inhibited cGMP 3',5'-cyclic phosphodiesterase 10A
(Homo sapiens (Human))
BDBM187206
(US9670181, 82 1-ethyl-4-((2-(ethylamino)-7-fluoro-...)
Show SMILES CCNc1nc2cc(F)c(OC)cc2cc1Cc1c(O)nc(CC)c2cc(OC)c(OC)cc12
Show InChI InChI=1S/C26H28FN3O4/c1-6-20-17-12-24(34-5)23(33-4)11-16(17)18(26(31)30-20)9-15-8-14-10-22(32-3)19(27)13-21(14)29-25(15)28-7-2/h8,10-13H,6-7,9H2,1-5H3,(H,28,29)(H,30,31)
Reactome pathway
US Patent
n/an/a 1.40n/an/an/an/a7.425
ALLERGAN, INC.; EXONHIT THERAPEUTICS SA
US Patent
Assay Description
The PDE assay is based on the homogenous time-resolved fluorescence resonance energy transfer (TR-FRET) technology (LANCE® from Perkin Elmer). This c...
US Patent US9670181 (2017)
BindingDB Entry DOI: 10.7270/Q21Z42KJ