BDBM187403 US9169252, 4
SMILES: CCNc1cc(ncc1C(=O)NC[C@@H](F)C(C)(C)O)-n1ccc2cc(cnc12)C#N
InChI Key: InChIKey=GHOYTVBLDYSILK-QGZVFWFLSA-N
Data: 1 IC50
Activity Spreadsheet -- Enzyme Inhibition Constant Data from BindingDB
Found 1 hit for monomerid = 187403
Trg + Lig
Ki
nM
ΔG°
kcal/mole
IC50
nM
Kd
nM
EC50/IC50
nM
koff
s-1
kon
M-1s-1
pHTemp
°C
Interleukin-1 receptor-associated kinase 4
(Homo sapiens (Human))
BDBM187403
(US9169252, 4)
Show SMILES CCNc1cc(ncc1C(=O)NC[C@@H](F)C(C)(C)O)-n1ccc2cc(cnc12)C#N |r|
Show InChI InChI=1S/C21H23FN6O2/c1-4-24-16-8-18(28-6-5-14-7-13(9-23)10-26-19(14)28)25-11-15(16)20(29)27-12-17(22)21(2,3)30/h5-8,10-11,17,30H,4,12H2,1-3H3,(H,24,25)(H,27,29)/t17-/m1/s1
Reactome pathway
US Patent
n/an/a 1.40n/an/an/an/a7.2n/a
Bristol-Myers Squibb Company
US Patent
Assay Description
The assays were performed in U-bottom 384-well plates. The final assay volume was 30 L prepared from 15 L additions of enzyme and substrates (fluores...
US Patent US9169252 (2015)
BindingDB Entry DOI: 10.7270/Q2MP5235