BDBM187829 US9169252, 372
SMILES: CCn1cc(Nc2cc(ncc2C(=O)NC[C@@H](F)C(C)(C)O)-n2ccc3cc(cnc23)C#N)cn1
InChI Key: InChIKey=GNKOKPXNXKQSAU-HXUWFJFHSA-N
Data: 1 IC50
Activity Spreadsheet -- Enzyme Inhibition Constant Data from BindingDB
Found 1 hit for monomerid = 187829
Trg + Lig
Ki
nM
ΔG°
kcal/mole
IC50
nM
Kd
nM
EC50/IC50
nM
koff
s-1
kon
M-1s-1
pHTemp
°C
Interleukin-1 receptor-associated kinase 4
(Homo sapiens (Human))
BDBM187829
(US9169252, 372)
Show SMILES CCn1cc(Nc2cc(ncc2C(=O)NC[C@@H](F)C(C)(C)O)-n2ccc3cc(cnc23)C#N)cn1 |r|
Show InChI InChI=1S/C24H25FN8O2/c1-4-32-14-17(11-30-32)31-19-8-21(33-6-5-16-7-15(9-26)10-28-22(16)33)27-12-18(19)23(34)29-13-20(25)24(2,3)35/h5-8,10-12,14,20,35H,4,13H2,1-3H3,(H,27,31)(H,29,34)/t20-/m1/s1
Reactome pathway
US Patent
n/an/a 1.20n/an/an/an/a7.2n/a
Bristol-Myers Squibb Company
US Patent
Assay Description
The assays were performed in U-bottom 384-well plates. The final assay volume was 30 L prepared from 15 L additions of enzyme and substrates (fluores...
US Patent US9169252 (2015)
BindingDB Entry DOI: 10.7270/Q2MP5235