BDBM188541 US9169246, 19
SMILES: CN1CCN(CC1)c1ccc(cc1)-c1ccc2c3[nH]ncc3c(=O)n(CC(F)(F)F)c2c1
InChI Key: InChIKey=JPNNMTISMNWCJD-UHFFFAOYSA-N
Data: 1 IC50
Activity Spreadsheet -- Enzyme Inhibition Constant Data from BindingDB
Found 1 hit for monomerid = 188541
Trg + Lig
Ki
nM
ΔG°
kcal/mole
IC50
nM
Kd
nM
EC50/IC50
nM
koff
s-1
kon
M-1s-1
pHTemp
°C
Methionine aminopeptidase 2
(Homo sapiens (Human))
BDBM188541
(US9169246, 19)
Show SMILES CN1CCN(CC1)c1ccc(cc1)-c1ccc2c3[nH]ncc3c(=O)n(CC(F)(F)F)c2c1
Show InChI InChI=1S/C23H22F3N5O/c1-29-8-10-30(11-9-29)17-5-2-15(3-6-17)16-4-7-18-20(12-16)31(14-23(24,25)26)22(32)19-13-27-28-21(18)19/h2-7,12-13H,8-11,14H2,1H3,(H,27,28)
Reactome pathway
US Patent
n/an/a 3.94n/an/an/an/an/an/a
SANOFI
US Patent
Assay Description
The enzymatic test is a test in two steps.In a first step, it consists in placing in contact the compound according to the invention, the dialysed Me...
US Patent US9169246 (2015)
BindingDB Entry DOI: 10.7270/Q2B856XZ