BDBM188571 US9169246, 70
SMILES: FC(F)(F)Cn1c2cc(ccc2c2[nH]ncc2c1=O)-c1ccnc(c1)N1CCNCC1
InChI Key: InChIKey=HRPLCTXLKMBUAW-UHFFFAOYSA-N
Data: 1 IC50
Activity Spreadsheet -- Enzyme Inhibition Constant Data from BindingDB
Found 1 hit for monomerid = 188571
Trg + Lig
Ki
nM
ΔG°
kcal/mole
IC50
nM
Kd
nM
EC50/IC50
nM
koff
s-1
kon
M-1s-1
pHTemp
°C
Methionine aminopeptidase 2
(Homo sapiens (Human))
BDBM188571
(US9169246, 70)
Show SMILES FC(F)(F)Cn1c2cc(ccc2c2[nH]ncc2c1=O)-c1ccnc(c1)N1CCNCC1
Show InChI InChI=1S/C21H19F3N6O/c22-21(23,24)12-30-17-9-13(1-2-15(17)19-16(20(30)31)11-27-28-19)14-3-4-26-18(10-14)29-7-5-25-6-8-29/h1-4,9-11,25H,5-8,12H2,(H,27,28)
Reactome pathway
US Patent
n/an/a 5.62n/an/an/an/an/an/a
SANOFI
US Patent
Assay Description
The enzymatic test is a test in two steps.In a first step, it consists in placing in contact the compound according to the invention, the dialysed Me...
US Patent US9169246 (2015)
BindingDB Entry DOI: 10.7270/Q2B856XZ