BDBM188659 US9169246, 199
SMILES: FC(F)(F)Cn1c2cc(c(Cl)cc2c2[nH]ncc2c1=O)-c1cccnc1Cl
InChI Key: InChIKey=GELCJBPLUIUKIY-UHFFFAOYSA-N
Data: 1 IC50
Activity Spreadsheet -- Enzyme Inhibition Constant Data from BindingDB
Found 1 hit for monomerid = 188659
Trg + Lig
Ki
nM
ΔG°
kcal/mole
IC50
nM
Kd
nM
EC50/IC50
nM
koff
s-1
kon
M-1s-1
pHTemp
°C
Methionine aminopeptidase 2
(Homo sapiens (Human))
BDBM188659
(US9169246, 199)
Show SMILES FC(F)(F)Cn1c2cc(c(Cl)cc2c2[nH]ncc2c1=O)-c1cccnc1Cl
Show InChI InChI=1S/C17H9Cl2F3N4O/c18-12-4-10-13(5-9(12)8-2-1-3-23-15(8)19)26(7-17(20,21)22)16(27)11-6-24-25-14(10)11/h1-6H,7H2,(H,24,25)
Reactome pathway
US Patent
n/an/a 4.90n/an/an/an/an/an/a
SANOFI
US Patent
Assay Description
The enzymatic test is a test in two steps.In a first step, it consists in placing in contact the compound according to the invention, the dialysed Me...
US Patent US9169246 (2015)
BindingDB Entry DOI: 10.7270/Q2B856XZ