BDBM188686 US9169246, 226
SMILES: CC(=O)Nc1cnccc1-c1ccc2c3[nH]ncc3c(=O)n(CC(F)(F)F)c2c1
InChI Key: InChIKey=VXCPGCDBUNFGFJ-UHFFFAOYSA-N
Data: 1 IC50
Activity Spreadsheet -- Enzyme Inhibition Constant Data from BindingDB
Found 1 hit for monomerid = 188686
Trg + Lig
Ki
nM
ΔG°
kcal/mole
IC50
nM
Kd
nM
EC50/IC50
nM
koff
s-1
kon
M-1s-1
pHTemp
°C
Methionine aminopeptidase 2
(Homo sapiens (Human))
BDBM188686
(US9169246, 226)
Show SMILES CC(=O)Nc1cnccc1-c1ccc2c3[nH]ncc3c(=O)n(CC(F)(F)F)c2c1
Show InChI InChI=1S/C19H14F3N5O2/c1-10(28)25-15-8-23-5-4-12(15)11-2-3-13-16(6-11)27(9-19(20,21)22)18(29)14-7-24-26-17(13)14/h2-8H,9H2,1H3,(H,24,26)(H,25,28)
Reactome pathway
US Patent
n/an/a 4.68n/an/an/an/an/an/a
SANOFI
US Patent
Assay Description
The enzymatic test is a test in two steps.In a first step, it consists in placing in contact the compound according to the invention, the dialysed Me...
US Patent US9169246 (2015)
BindingDB Entry DOI: 10.7270/Q2B856XZ