BDBM188706 US9169246, 248
SMILES: CN(C)c1ncccc1-c1ccc2c3[nH]ncc3c(=O)n(CC(F)(F)F)c2c1
InChI Key: InChIKey=JEBWTIKSUAHOAZ-UHFFFAOYSA-N
Data: 1 IC50
Activity Spreadsheet -- Enzyme Inhibition Constant Data from BindingDB
Found 1 hit for monomerid = 188706
Trg + Lig
Ki
nM
ΔG°
kcal/mole
IC50
nM
Kd
nM
EC50/IC50
nM
koff
s-1
kon
M-1s-1
pHTemp
°C
Methionine aminopeptidase 2
(Homo sapiens (Human))
BDBM188706
(US9169246, 248)
Show SMILES CN(C)c1ncccc1-c1ccc2c3[nH]ncc3c(=O)n(CC(F)(F)F)c2c1
Show InChI InChI=1S/C19H16F3N5O/c1-26(2)17-12(4-3-7-23-17)11-5-6-13-15(8-11)27(10-19(20,21)22)18(28)14-9-24-25-16(13)14/h3-9H,10H2,1-2H3,(H,24,25)
Reactome pathway
US Patent
n/an/a 3.87n/an/an/an/an/an/a
SANOFI
US Patent
Assay Description
The enzymatic test is a test in two steps.In a first step, it consists in placing in contact the compound according to the invention, the dialysed Me...
US Patent US9169246 (2015)
BindingDB Entry DOI: 10.7270/Q2B856XZ