BDBM188773 US9169260, 325::US9169260, 39
SMILES: Cc1ccc(cc1)-n1nc(cc1NC(=O)c1cnn2cccnc12)C1CCN(CC1)C1CCCC1
InChI Key: InChIKey=PHWPXXAISWPGBW-UHFFFAOYSA-N
Data: 2 IC50
Activity Spreadsheet -- Enzyme Inhibition Constant Data from BindingDB
Found 2 hits for monomerid = 188773
Trg + Lig
Ki
nM
ΔG°
kcal/mole
IC50
nM
Kd
nM
EC50/IC50
nM
koff
s-1
kon
M-1s-1
pHTemp
°C
Interleukin-1 receptor-associated kinase 4
(Homo sapiens (Human))
BDBM188773
(US9169260, 325 | US9169260, 39)
Show SMILES Cc1ccc(cc1)-n1nc(cc1NC(=O)c1cnn2cccnc12)C1CCN(CC1)C1CCCC1
Show InChI InChI=1S/C27H31N7O/c1-19-7-9-22(10-8-19)34-25(30-27(35)23-18-29-33-14-4-13-28-26(23)33)17-24(31-34)20-11-15-32(16-12-20)21-5-2-3-6-21/h4,7-10,13-14,17-18,20-21H,2-3,5-6,11-12,15-16H2,1H3,(H,30,35)
Reactome pathway
US Patent
n/an/a<100n/an/an/an/a7.2n/a
MERCK SHARP & DOHME CORP.
US Patent
Assay Description
The kinase activity of IRAK-4 is determined by its ability to catalyze the phosphorylation of a fluorescent polypeptide substrate. The extent of phos...
US Patent US9169260 (2015)
BindingDB Entry DOI: 10.7270/Q26H4G6N
Interleukin-1 receptor-associated kinase 4
(Homo sapiens (Human))
BDBM188773
(US9169260, 325 | US9169260, 39)
Show SMILES Cc1ccc(cc1)-n1nc(cc1NC(=O)c1cnn2cccnc12)C1CCN(CC1)C1CCCC1
Show InChI InChI=1S/C27H31N7O/c1-19-7-9-22(10-8-19)34-25(30-27(35)23-18-29-33-14-4-13-28-26(23)33)17-24(31-34)20-11-15-32(16-12-20)21-5-2-3-6-21/h4,7-10,13-14,17-18,20-21H,2-3,5-6,11-12,15-16H2,1H3,(H,30,35)
Reactome pathway
US Patent
n/an/a<100n/an/an/an/a7.2n/a
MERCK SHARP & DOHME CORP.
US Patent
Assay Description
The kinase activity of IRAK-4 is determined by its ability to catalyze the phosphorylation of a fluorescent polypeptide substrate. The extent of phos...
US Patent US9169260 (2015)
BindingDB Entry DOI: 10.7270/Q26H4G6N