BDBM188830 US9169260, 96
SMILES: CN(C)C(=O)C1CCC(CC1)c1cc(NC(=O)c2cnn3cccnc23)n(n1)-c1ccc(C)cc1
InChI Key: InChIKey=MGIJODYGXLPFMO-UHFFFAOYSA-N
Data: 1 IC50
Activity Spreadsheet -- Enzyme Inhibition Constant Data from BindingDB
Found 1 hit for monomerid = 188830
Trg + Lig
Ki
nM
ΔG°
kcal/mole
IC50
nM
Kd
nM
EC50/IC50
nM
koff
s-1
kon
M-1s-1
pHTemp
°C
Interleukin-1 receptor-associated kinase 4
(Homo sapiens (Human))
BDBM188830
(US9169260, 96)
Show SMILES CN(C)C(=O)C1CCC(CC1)c1cc(NC(=O)c2cnn3cccnc23)n(n1)-c1ccc(C)cc1 |(-.4,-9.67,;0,-8.18,;1.54,-8.18,;-1.09,-7.09,;-2.57,-7.49,;-.69,-5.61,;-1.78,-4.52,;-1.38,-3.03,;.11,-2.63,;1.2,-3.72,;.8,-5.21,;.51,-1.14,;-.4,.1,;.51,1.35,;.11,2.84,;-1.38,3.24,;-2.47,2.15,;-1.78,4.72,;-1.3,6.19,;-2.55,7.09,;-3.79,6.19,;-5.3,6.51,;-6.33,5.36,;-5.85,3.9,;-4.35,3.58,;-3.32,4.72,;1.97,.87,;1.97,-.67,;3.06,1.96,;4.55,1.56,;5.64,2.65,;5.24,4.14,;6.33,5.23,;3.75,4.54,;2.66,3.45,)|
Show InChI InChI=1S/C26H29N7O2/c1-17-5-11-20(12-6-17)33-23(29-25(34)21-16-28-32-14-4-13-27-24(21)32)15-22(30-33)18-7-9-19(10-8-18)26(35)31(2)3/h4-6,11-16,18-19H,7-10H2,1-3H3,(H,29,34)
Reactome pathway
US Patent
n/an/a<100n/an/an/an/a7.2n/a
MERCK SHARP & DOHME CORP.
US Patent
Assay Description
The kinase activity of IRAK-4 is determined by its ability to catalyze the phosphorylation of a fluorescent polypeptide substrate. The extent of phos...
US Patent US9169260 (2015)
BindingDB Entry DOI: 10.7270/Q26H4G6N