BDBM188852 US9169260, 118
SMILES: COC(=O)N1CCC(CC1)c1cc(NC(=O)c2cnn3cc(Br)cnc23)n(n1)-c1ccc(C)cc1
InChI Key: InChIKey=URAHBGFUGFHELR-UHFFFAOYSA-N
Data: 1 IC50
Activity Spreadsheet -- Enzyme Inhibition Constant Data from BindingDB
Found 1 hit for monomerid = 188852
Trg + Lig
Ki
nM
ΔG°
kcal/mole
IC50
nM
Kd
nM
EC50/IC50
nM
koff
s-1
kon
M-1s-1
pHTemp
°C
Interleukin-1 receptor-associated kinase 4
(Homo sapiens (Human))
BDBM188852
(US9169260, 118)
Show SMILES COC(=O)N1CCC(CC1)c1cc(NC(=O)c2cnn3cc(Br)cnc23)n(n1)-c1ccc(C)cc1
Show InChI InChI=1S/C24H24BrN7O3/c1-15-3-5-18(6-4-15)32-21(11-20(29-32)16-7-9-30(10-8-16)24(34)35-2)28-23(33)19-13-27-31-14-17(25)12-26-22(19)31/h3-6,11-14,16H,7-10H2,1-2H3,(H,28,33)
Reactome pathway
US Patent
n/an/a<100n/an/an/an/a7.2n/a
MERCK SHARP & DOHME CORP.
US Patent
Assay Description
The kinase activity of IRAK-4 is determined by its ability to catalyze the phosphorylation of a fluorescent polypeptide substrate. The extent of phos...
US Patent US9169260 (2015)
BindingDB Entry DOI: 10.7270/Q26H4G6N