BDBM188873 US9169260, 139
SMILES: Cc1ccc(cc1)-n1nc(cc1NC(=O)C1=C2N=CC=C[N]2=NC1)C1=CCN(CC1)S(C)(=O)=O
InChI Key: InChIKey=HRWPXKWZMMYBKG-UHFFFAOYSA-N
Data: 1 IC50
Activity Spreadsheet -- Enzyme Inhibition Constant Data from BindingDB
Found 1 hit for monomerid = 188873
Trg + Lig
Ki
nM
ΔG°
kcal/mole
IC50
nM
Kd
nM
EC50/IC50
nM
koff
s-1
kon
M-1s-1
pHTemp
°C
Interleukin-1 receptor-associated kinase 4
(Homo sapiens (Human))
BDBM188873
(US9169260, 139)
Show SMILES Cc1ccc(cc1)-n1nc(cc1NC(=O)C1=C2N=CC=C[N]2=NC1)C1=CCN(CC1)S(C)(=O)=O |c:17,19,21,24,t:28|
Show InChI InChI=1S/C23H24N7O3S/c1-16-4-6-18(7-5-16)30-21(26-23(31)19-15-25-29-11-3-10-24-22(19)29)14-20(27-30)17-8-12-28(13-9-17)34(2,32)33/h3-8,10-11,14H,9,12-13,15H2,1-2H3,(H,26,31)
Reactome pathway
US Patent
n/an/a<100n/an/an/an/a7.2n/a
MERCK SHARP & DOHME CORP.
US Patent
Assay Description
The kinase activity of IRAK-4 is determined by its ability to catalyze the phosphorylation of a fluorescent polypeptide substrate. The extent of phos...
US Patent US9169260 (2015)
BindingDB Entry DOI: 10.7270/Q26H4G6N