BDBM188899 US9169260, 165
SMILES: CS(=O)(=O)N1CCC(CC1)c1cc(NC(=O)c2cnn3cccnc23)n(n1)-c1ccc(C=O)cn1
InChI Key: InChIKey=NPTJPWJJQYJSNN-UHFFFAOYSA-N
Data: 1 IC50
Activity Spreadsheet -- Enzyme Inhibition Constant Data from BindingDB
Found 1 hit for monomerid = 188899
Trg + Lig
Ki
nM
ΔG°
kcal/mole
IC50
nM
Kd
nM
EC50/IC50
nM
koff
s-1
kon
M-1s-1
pHTemp
°C
Interleukin-1 receptor-associated kinase 4
(Homo sapiens (Human))
BDBM188899
(US9169260, 165)
Show SMILES CS(=O)(=O)N1CCC(CC1)c1cc(NC(=O)c2cnn3cccnc23)n(n1)-c1ccc(C=O)cn1
Show InChI InChI=1S/C22H22N8O4S/c1-35(33,34)28-9-5-16(6-10-28)18-11-20(30(27-18)19-4-3-15(14-31)12-24-19)26-22(32)17-13-25-29-8-2-7-23-21(17)29/h2-4,7-8,11-14,16H,5-6,9-10H2,1H3,(H,26,32)
Reactome pathway
US Patent
n/an/a<100n/an/an/an/a7.2n/a
MERCK SHARP & DOHME CORP.
US Patent
Assay Description
The kinase activity of IRAK-4 is determined by its ability to catalyze the phosphorylation of a fluorescent polypeptide substrate. The extent of phos...
US Patent US9169260 (2015)
BindingDB Entry DOI: 10.7270/Q26H4G6N