BDBM188935 US9169260, 201
SMILES: CN1CCN(CC1)c1cc(NC(=O)c2cnn3cccnc23)n(n1)-c1ccc(cn1)C1CC1
InChI Key: InChIKey=MDOOYOLKJFRCAI-UHFFFAOYSA-N
Data: 1 IC50
Activity Spreadsheet -- Enzyme Inhibition Constant Data from BindingDB
Found 1 hit for monomerid = 188935
Trg + Lig
Ki
nM
ΔG°
kcal/mole
IC50
nM
Kd
nM
EC50/IC50
nM
koff
s-1
kon
M-1s-1
pHTemp
°C
Interleukin-1 receptor-associated kinase 4
(Homo sapiens (Human))
BDBM188935
(US9169260, 201)
Show SMILES CN1CCN(CC1)c1cc(NC(=O)c2cnn3cccnc23)n(n1)-c1ccc(cn1)C1CC1
Show InChI InChI=1S/C23H25N9O/c1-29-9-11-30(12-10-29)21-13-20(27-23(33)18-15-26-31-8-2-7-24-22(18)31)32(28-21)19-6-5-17(14-25-19)16-3-4-16/h2,5-8,13-16H,3-4,9-12H2,1H3,(H,27,33)
Reactome pathway
US Patent
n/an/a<100n/an/an/an/a7.2n/a
MERCK SHARP & DOHME CORP.
US Patent
Assay Description
The kinase activity of IRAK-4 is determined by its ability to catalyze the phosphorylation of a fluorescent polypeptide substrate. The extent of phos...
US Patent US9169260 (2015)
BindingDB Entry DOI: 10.7270/Q26H4G6N