BDBM188944 US9169260, 210
SMILES: CCCC(C)N1CCC(CC1)c1cc(NC(=O)c2cnn3cccnc23)n(n1)-c1ccc(C)cc1
InChI Key: InChIKey=GBBBRGOAYWIKEL-UHFFFAOYSA-N
Data: 1 IC50
Activity Spreadsheet -- Enzyme Inhibition Constant Data from BindingDB
Found 1 hit for monomerid = 188944
Trg + Lig
Ki
nM
ΔG°
kcal/mole
IC50
nM
Kd
nM
EC50/IC50
nM
koff
s-1
kon
M-1s-1
pHTemp
°C
Interleukin-1 receptor-associated kinase 4
(Homo sapiens (Human))
BDBM188944
(US9169260, 210)
Show SMILES CCCC(C)N1CCC(CC1)c1cc(NC(=O)c2cnn3cccnc23)n(n1)-c1ccc(C)cc1
Show InChI InChI=1S/C27H33N7O/c1-4-6-20(3)32-15-11-21(12-16-32)24-17-25(34(31-24)22-9-7-19(2)8-10-22)30-27(35)23-18-29-33-14-5-13-28-26(23)33/h5,7-10,13-14,17-18,20-21H,4,6,11-12,15-16H2,1-3H3,(H,30,35)
Reactome pathway
US Patent
n/an/a<100n/an/an/an/a7.2n/a
MERCK SHARP & DOHME CORP.
US Patent
Assay Description
The kinase activity of IRAK-4 is determined by its ability to catalyze the phosphorylation of a fluorescent polypeptide substrate. The extent of phos...
US Patent US9169260 (2015)
BindingDB Entry DOI: 10.7270/Q26H4G6N