BDBM189079 US9169260, 348
SMILES: CNC(=O)c1ccc(cc1)-c1cc(NC(=O)c2cnn3cccnc23)n(n1)-c1ccc(C)cc1
InChI Key: InChIKey=OEQPWNJQGQNSKB-UHFFFAOYSA-N
Data: 1 IC50
Activity Spreadsheet -- Enzyme Inhibition Constant Data from BindingDB
Found 1 hit for monomerid = 189079
Trg + Lig
Ki
nM
ΔG°
kcal/mole
IC50
nM
Kd
nM
EC50/IC50
nM
koff
s-1
kon
M-1s-1
pHTemp
°C
Interleukin-1 receptor-associated kinase 4
(Homo sapiens (Human))
BDBM189079
(US9169260, 348)
Show SMILES CNC(=O)c1ccc(cc1)-c1cc(NC(=O)c2cnn3cccnc23)n(n1)-c1ccc(C)cc1
Show InChI InChI=1S/C25H21N7O2/c1-16-4-10-19(11-5-16)32-22(29-25(34)20-15-28-31-13-3-12-27-23(20)31)14-21(30-32)17-6-8-18(9-7-17)24(33)26-2/h3-15H,1-2H3,(H,26,33)(H,29,34)
Reactome pathway
US Patent
n/an/a<100n/an/an/an/a7.2n/a
MERCK SHARP & DOHME CORP.
US Patent
Assay Description
The kinase activity of IRAK-4 is determined by its ability to catalyze the phosphorylation of a fluorescent polypeptide substrate. The extent of phos...
US Patent US9169260 (2015)
BindingDB Entry DOI: 10.7270/Q26H4G6N