BDBM18915 2-{4-[3-bromo-4-(2-methylpropanamido)phenoxy]-3,5-dichlorophenyl}acetic acid::4-amido bioisosteric ligand, 12b
SMILES: CC(C)C(=O)Nc1ccc(Oc2c(Cl)cc(CC(O)=O)cc2Cl)cc1Br
InChI Key: InChIKey=HHSRCUBLBZYJPA-UHFFFAOYSA-N
Data: 5 IC50
Activity Spreadsheet -- Enzyme Inhibition Constant Data from BindingDB
Found 5 hits for monomerid = 18915
Trg + Lig
Ki
nM
ΔG°
kcal/mole
IC50
nM
Kd
nM
EC50/IC50
nM
koff
s-1
kon
M-1s-1
pHTemp
°C
Thyroid hormone receptor alpha
(Homo sapiens (Human))
BDBM18915
(2-{4-[3-bromo-4-(2-methylpropanamido)phenoxy]-3,5-...)
Show SMILES CC(C)C(=O)Nc1ccc(Oc2c(Cl)cc(CC(O)=O)cc2Cl)cc1Br
Show InChI InChI=1S/C18H16BrCl2NO4/c1-9(2)18(25)22-15-4-3-11(8-12(15)19)26-17-13(20)5-10(6-14(17)21)7-16(23)24/h3-6,8-9H,7H2,1-2H3,(H,22,25)(H,23,24)
NCI pathway
Reactome pathway
n/an/a 630n/an/an/an/a7.04
Karo Bio AB
Assay Description
IC50 is the concentration of each compound required to inhibit 50% binding of 125I-T3 to hTRalpha.
Bioorg Med Chem Lett 16: 884-6 (2006)
Article DOI: 10.1016/j.bmcl.2005.11.002
BindingDB Entry DOI: 10.7270/Q2BV7DWM
Thyroid hormone receptor beta
(Homo sapiens (Human))
BDBM18915
(2-{4-[3-bromo-4-(2-methylpropanamido)phenoxy]-3,5-...)
Show SMILES CC(C)C(=O)Nc1ccc(Oc2c(Cl)cc(CC(O)=O)cc2Cl)cc1Br
Show InChI InChI=1S/C18H16BrCl2NO4/c1-9(2)18(25)22-15-4-3-11(8-12(15)19)26-17-13(20)5-10(6-14(17)21)7-16(23)24/h3-6,8-9H,7H2,1-2H3,(H,22,25)(H,23,24)
NCI pathway
Reactome pathway
n/an/a 18n/an/an/an/a7.04
Karo Bio AB
Assay Description
IC50 is the concentration of each compound required to inhibit 50% binding of 125I-T3 to hTRbeta.
Bioorg Med Chem Lett 16: 884-6 (2006)
Article DOI: 10.1016/j.bmcl.2005.11.002
BindingDB Entry DOI: 10.7270/Q2BV7DWM
Thyroid hormone receptor alpha
(Homo sapiens (Human))
BDBM18915
(2-{4-[3-bromo-4-(2-methylpropanamido)phenoxy]-3,5-...)
Show SMILES CC(C)C(=O)Nc1ccc(Oc2c(Cl)cc(CC(O)=O)cc2Cl)cc1Br
Show InChI InChI=1S/C18H16BrCl2NO4/c1-9(2)18(25)22-15-4-3-11(8-12(15)19)26-17-13(20)5-10(6-14(17)21)7-16(23)24/h3-6,8-9H,7H2,1-2H3,(H,22,25)(H,23,24)
NCI pathway
Reactome pathway
n/an/a 631n/an/an/an/an/an/a
Universidade de S£o Paulo
Curated by ChEMBL
Assay Description
Inhibition of thyroid hormone receptor alpha
Bioorg Med Chem 15: 4609-17 (2007)
Article DOI: 10.1016/j.bmc.2007.04.015
BindingDB Entry DOI: 10.7270/Q2W37XJQ
Thyroid hormone receptor beta
(Homo sapiens (Human))
BDBM18915
(2-{4-[3-bromo-4-(2-methylpropanamido)phenoxy]-3,5-...)
Show SMILES CC(C)C(=O)Nc1ccc(Oc2c(Cl)cc(CC(O)=O)cc2Cl)cc1Br
Show InChI InChI=1S/C18H16BrCl2NO4/c1-9(2)18(25)22-15-4-3-11(8-12(15)19)26-17-13(20)5-10(6-14(17)21)7-16(23)24/h3-6,8-9H,7H2,1-2H3,(H,22,25)(H,23,24)
NCI pathway
Reactome pathway
n/an/a 18.2n/an/an/an/an/an/a
Universidade de S£o Paulo
Curated by ChEMBL
Assay Description
Inhibition of thyroid hormone receptor beta
Bioorg Med Chem 15: 4609-17 (2007)
Article DOI: 10.1016/j.bmc.2007.04.015
BindingDB Entry DOI: 10.7270/Q2W37XJQ
Thyroid hormone receptor beta
(Homo sapiens (Human))
BDBM18915
(2-{4-[3-bromo-4-(2-methylpropanamido)phenoxy]-3,5-...)
Show SMILES CC(C)C(=O)Nc1ccc(Oc2c(Cl)cc(CC(O)=O)cc2Cl)cc1Br
Show InChI InChI=1S/C18H16BrCl2NO4/c1-9(2)18(25)22-15-4-3-11(8-12(15)19)26-17-13(20)5-10(6-14(17)21)7-16(23)24/h3-6,8-9H,7H2,1-2H3,(H,22,25)(H,23,24)
NCI pathway
Reactome pathway
n/an/a 18.2n/an/an/an/an/an/a
University of Insubria
Curated by ChEMBL
Assay Description
Inhibition of human thyroid hormone receptor beta 1
Bioorg Med Chem 15: 5251-61 (2007)
Article DOI: 10.1016/j.bmc.2007.05.016
BindingDB Entry DOI: 10.7270/Q2PK0HD8