null
SMILES: CC(C)CCOC(=O)N1CCc2ncsc2[C@H]1c1cc(Cl)ccc1OCC(O)=O
InChI Key: InChIKey=IZLKKNJNSCPGRY-GOSISDBHSA-N
Activity Spreadsheet -- Enzyme Inhibition Constant Data from BindingDB
Found 1 hit for monomerid = 189195
Trg + Lig
Ki
nM
ΔG°
kcal/mole
IC50
nM
Kd
nM
EC50/IC50
nM
koff
s-1
kon
M-1s-1
pHTemp
°C
Prostaglandin D2 receptor 2
(Homo sapiens (Human))
BDBM189195
(US9169270, 67)
Show SMILES CC(C)CCOC(=O)N1CCc2ncsc2[C@H]1c1cc(Cl)ccc1OCC(O)=O
Show InChI InChI=1S/C20H23ClN2O5S/c1-12(2)6-8-27-20(26)23-7-5-15-19(29-11-22-15)18(23)14-9-13(21)3-4-16(14)28-10-17(24)25/h3-4,9,11-12,18H,5-8,10H2,1-2H3,(H,24,25)/t18-/m1/s1
Reactome pathway
US Patent
n/an/a 0.400n/an/an/an/a7.025
Actelion Pharmaceuticals Ltd.
US Patent
Assay Description
Binding assay was performed in a final assay volume of 250 μl. First, 25 μl of test compound, previously diluted in Binding-Buffer (Binding...
US Patent US9169270 (2015)
BindingDB Entry DOI: 10.7270/Q22R3QFG