null
SMILES: CC[C@H](Nc1ncnc(N)c1-c1nnc(C)o1)c1nc2cccc(Cl)c2c(=O)n1-c1cccc(F)c1
InChI Key: InChIKey=GQZDNQHRAODTQX-INIZCTEOSA-N
Activity Spreadsheet -- Enzyme Inhibition Constant Data from BindingDB
Found 4 hits for monomerid = 189306
Trg + Lig
Ki
nM
ΔG°
kcal/mole
IC50
nM
Kd
nM
EC50/IC50
nM
koff
s-1
kon
M-1s-1
pHTemp
°C
Phosphatidylinositol 3-kinase regulatory subunit alpha/4,5-bisphosphate 3-kinase catalytic subunit alpha isoform
(Homo sapiens (Human))
BDBM189306
(US9670194, Ex. 34 (S)-2-(1-((6-amino-5-(5-methyl-1...)
Show SMILES CC[C@H](Nc1ncnc(N)c1-c1nnc(C)o1)c1nc2cccc(Cl)c2c(=O)n1-c1cccc(F)c1 |r|
Show InChI InChI=1S/C24H20ClFN8O2/c1-3-16(30-21-19(20(27)28-11-29-21)23-33-32-12(2)36-23)22-31-17-9-5-8-15(25)18(17)24(35)34(22)14-7-4-6-13(26)10-14/h4-11,16H,3H2,1-2H3,(H3,27,28,29,30)/t16-/m0/s1
US Patent
n/an/a>3.00E+3n/an/an/an/an/a25
CALITOR SCIENCES, LLC; SUNSHINE LAKE PHARMA CO., LTD.
US Patent
Assay Description
PI3K (p110α/p85α) (h) is incubated in assay buffer containing 10 μM phosphatidylinositol 4,5-bisphosphate and MgATP (concentration as ...
US Patent US9670194 (2017)
BindingDB Entry DOI: 10.7270/Q2NS0S1D
Phosphatidylinositol 4,5-bisphosphate 3-kinase catalytic subunit gamma isoform
(Homo sapiens (Human))
BDBM189306
(US9670194, Ex. 34 (S)-2-(1-((6-amino-5-(5-methyl-1...)
Show SMILES CC[C@H](Nc1ncnc(N)c1-c1nnc(C)o1)c1nc2cccc(Cl)c2c(=O)n1-c1cccc(F)c1 |r|
Show InChI InChI=1S/C24H20ClFN8O2/c1-3-16(30-21-19(20(27)28-11-29-21)23-33-32-12(2)36-23)22-31-17-9-5-8-15(25)18(17)24(35)34(22)14-7-4-6-13(26)10-14/h4-11,16H,3H2,1-2H3,(H3,27,28,29,30)/t16-/m0/s1
NCI pathway
Reactome pathway
US Patent
n/an/a>3.00E+3n/an/an/an/an/a25
CALITOR SCIENCES, LLC; SUNSHINE LAKE PHARMA CO., LTD.
US Patent
Assay Description
PI3K (p110α/p85α) (h) is incubated in assay buffer containing 10 μM phosphatidylinositol 4,5-bisphosphate and MgATP (concentration as ...
US Patent US9670194 (2017)
BindingDB Entry DOI: 10.7270/Q2NS0S1D
Phosphatidylinositol 4,5-bisphosphate 3-kinase catalytic subunit beta/delta isoform
(Homo sapiens (Human))
BDBM189306
(US9670194, Ex. 34 (S)-2-(1-((6-amino-5-(5-methyl-1...)
Show SMILES CC[C@H](Nc1ncnc(N)c1-c1nnc(C)o1)c1nc2cccc(Cl)c2c(=O)n1-c1cccc(F)c1 |r|
Show InChI InChI=1S/C24H20ClFN8O2/c1-3-16(30-21-19(20(27)28-11-29-21)23-33-32-12(2)36-23)22-31-17-9-5-8-15(25)18(17)24(35)34(22)14-7-4-6-13(26)10-14/h4-11,16H,3H2,1-2H3,(H3,27,28,29,30)/t16-/m0/s1
US Patent
n/an/a 12n/an/an/an/an/a25
CALITOR SCIENCES, LLC; SUNSHINE LAKE PHARMA CO., LTD.
US Patent
Assay Description
PI3K (p110α/p85α) (h) is incubated in assay buffer containing 10 μM phosphatidylinositol 4,5-bisphosphate and MgATP (concentration as ...
US Patent US9670194 (2017)
BindingDB Entry DOI: 10.7270/Q2NS0S1D
Phosphatidylinositol 3-kinase regulatory subunit alpha/4,5-bisphosphate 3-kinase catalytic subunit beta isoform
(Homo sapiens (Human))
BDBM189306
(US9670194, Ex. 34 (S)-2-(1-((6-amino-5-(5-methyl-1...)
Show SMILES CC[C@H](Nc1ncnc(N)c1-c1nnc(C)o1)c1nc2cccc(Cl)c2c(=O)n1-c1cccc(F)c1 |r|
Show InChI InChI=1S/C24H20ClFN8O2/c1-3-16(30-21-19(20(27)28-11-29-21)23-33-32-12(2)36-23)22-31-17-9-5-8-15(25)18(17)24(35)34(22)14-7-4-6-13(26)10-14/h4-11,16H,3H2,1-2H3,(H3,27,28,29,30)/t16-/m0/s1
US Patent
n/an/a 1.36E+3n/an/an/an/an/a25
CALITOR SCIENCES, LLC; SUNSHINE LAKE PHARMA CO., LTD.
US Patent
Assay Description
PI3K (p110β/p85α) (h) is incubated in assay buffer containing 10 μM phosphatidylinositol-4,5-bisphosphate and MgATP (concentration as ...
US Patent US9670194 (2017)
BindingDB Entry DOI: 10.7270/Q2NS0S1D