BDBM189403 US9670194, Ex. 37 (S)-2-(1-((6-amino-5-(3-methyl-1,2,4-oxadiazol-5-yl)pyrimidin-4-yl)amino)-propyl)-5-methyl-3-phenylquinazolin-4(3H)-one
SMILES: CC[C@H](Nc1ncnc(N)c1-c1nc(C)no1)c1nc2cccc(C)c2c(=O)n1-c1ccccc1
InChI Key: InChIKey=GEFHERTXXZZVJI-KRWDZBQOSA-N
Data: 1 IC50
Activity Spreadsheet -- Enzyme Inhibition Constant Data from BindingDB
Found 1 hit for monomerid = 189403
Trg + Lig
Ki
nM
ΔG°
kcal/mole
IC50
nM
Kd
nM
EC50/IC50
nM
koff
s-1
kon
M-1s-1
pHTemp
°C
p110δ/p85α
(Homo sapiens (Human))
BDBM189403
(US9670194, Ex. 37 (S)-2-(1-((6-amino-5-(3-methyl-1...)
Show SMILES CC[C@H](Nc1ncnc(N)c1-c1nc(C)no1)c1nc2cccc(C)c2c(=O)n1-c1ccccc1 |r|
Show InChI InChI=1S/C25H24N8O2/c1-4-17(30-22-20(21(26)27-13-28-22)24-29-15(3)32-35-24)23-31-18-12-8-9-14(2)19(18)25(34)33(23)16-10-6-5-7-11-16/h5-13,17H,4H2,1-3H3,(H3,26,27,28,30)/t17-/m0/s1
US Patent
n/an/a 6n/an/an/an/an/a25
CALITOR SCIENCES, LLC; SUNSHINE LAKE PHARMA CO., LTD.
US Patent
Assay Description
PI3K (p110α/p85α) (h) is incubated in assay buffer containing 10 μM phosphatidylinositol 4,5-bisphosphate and MgATP (concentration as ...
US Patent US9670194 (2017)
BindingDB Entry DOI: 10.7270/Q2NS0S1D