BDBM189422 US9174974, Example 7
SMILES: C[C@H]1COC(=O)Nc2ccc(C(=O)N3CCC3)c(CN(C)C(=O)[C@H](Nc3ccc4c(N)nccc4c3)c3ccc1c(C)c3)c2
InChI Key: InChIKey=YPFSPXBNHPKHEY-URAOTHONSA-N
Data: 2 KI
Activity Spreadsheet -- Enzyme Inhibition Constant Data from BindingDB
Found 2 hits for monomerid = 189422
Trg + Lig
Ki
nM
ΔG°
kcal/mole
IC50
nM
Kd
nM
EC50/IC50
nM
koff
s-1
kon
M-1s-1
pHTemp
°C
Coagulation factor VII
(Homo sapiens (Human))
BDBM189422
(US9174974, Example 7)
Show SMILES C[C@H]1COC(=O)Nc2ccc(C(=O)N3CCC3)c(CN(C)C(=O)[C@H](Nc3ccc4c(N)nccc4c3)c3ccc1c(C)c3)c2 |r|
Show InChI InChI=1S/C34H36N6O4/c1-20-15-23-5-8-27(20)21(2)19-44-34(43)38-26-7-10-29(32(41)40-13-4-14-40)24(17-26)18-39(3)33(42)30(23)37-25-6-9-28-22(16-25)11-12-36-31(28)35/h5-12,15-17,21,30,37H,4,13-14,18-19H2,1-3H3,(H2,35,36)(H,38,43)/t21-,30+/m0/s1
Reactome pathway
US Patent
1.20n/an/an/an/an/an/an/an/a
Bristol-Myers Squibb Company
US Patent
Assay Description
FVIIa-Xase Ki (37° C.): S2765 (0.5 mM), PCPS (25 μM), calcium chloride (5 mM), full-length human TF (3 nM), human FVIIa (5 pM), and FVIIa inhibi...
US Patent US9174974 (2015)
BindingDB Entry DOI: 10.7270/Q2W37V32
Coagulation factor VII
(Homo sapiens (Human))
BDBM189422
(US9174974, Example 7)
Show SMILES C[C@H]1COC(=O)Nc2ccc(C(=O)N3CCC3)c(CN(C)C(=O)[C@H](Nc3ccc4c(N)nccc4c3)c3ccc1c(C)c3)c2 |r|
Show InChI InChI=1S/C34H36N6O4/c1-20-15-23-5-8-27(20)21(2)19-44-34(43)38-26-7-10-29(32(41)40-13-4-14-40)24(17-26)18-39(3)33(42)30(23)37-25-6-9-28-22(16-25)11-12-36-31(28)35/h5-12,15-17,21,30,37H,4,13-14,18-19H2,1-3H3,(H2,35,36)(H,38,43)/t21-,30+/m0/s1
Reactome pathway
US Patent
630n/an/an/an/an/an/a7.4n/a
Bristol-Myers Squibb Company
US Patent
Assay Description
Tissue kallikrein-1 (37° C) activity was determined in reactions containing 0.05 nM enzyme and 90 μM substrate (H-D-Val-Leu-Arg-AFC) in buffer (...
US Patent US9174974 (2015)
BindingDB Entry DOI: 10.7270/Q2W37V32