null
SMILES: C[C@H]1COC(=O)Nc2cc(F)c(OCCN3CCCC3=O)c(CN(C)C(=O)[C@H](Nc3ccc4c(N)nccc4c3)c3ccc1c(C)c3)c2
InChI Key: InChIKey=MLPWLOKRIFVGKZ-GHRAFVERSA-N
Activity Spreadsheet -- Enzyme Inhibition Constant Data from BindingDB
Found 2 hits for monomerid = 189449
Trg + Lig
Ki
nM
ΔG°
kcal/mole
IC50
nM
Kd
nM
EC50/IC50
nM
koff
s-1
kon
M-1s-1
pHTemp
°C
Coagulation factor VII
(Homo sapiens (Human))
BDBM189449
(US9174974, Example 35)
Show SMILES C[C@H]1COC(=O)Nc2cc(F)c(OCCN3CCCC3=O)c(CN(C)C(=O)[C@H](Nc3ccc4c(N)nccc4c3)c3ccc1c(C)c3)c2 |r|
Show InChI InChI=1S/C36H39FN6O5/c1-21-15-24-6-8-28(21)22(2)20-48-36(46)41-27-17-25(33(30(37)18-27)47-14-13-43-12-4-5-31(43)44)19-42(3)35(45)32(24)40-26-7-9-29-23(16-26)10-11-39-34(29)38/h6-11,15-18,22,32,40H,4-5,12-14,19-20H2,1-3H3,(H2,38,39)(H,41,46)/t22-,32+/m0/s1
Reactome pathway
US Patent
0.140n/an/an/an/an/an/an/an/a
Bristol-Myers Squibb Company
US Patent
Assay Description
FVIIa-Xase Ki (37° C.): S2765 (0.5 mM), PCPS (25 μM), calcium chloride (5 mM), full-length human TF (3 nM), human FVIIa (5 pM), and FVIIa inhibi...
US Patent US9174974 (2015)
BindingDB Entry DOI: 10.7270/Q2W37V32
Coagulation factor VII
(Homo sapiens (Human))
BDBM189449
(US9174974, Example 35)
Show SMILES C[C@H]1COC(=O)Nc2cc(F)c(OCCN3CCCC3=O)c(CN(C)C(=O)[C@H](Nc3ccc4c(N)nccc4c3)c3ccc1c(C)c3)c2 |r|
Show InChI InChI=1S/C36H39FN6O5/c1-21-15-24-6-8-28(21)22(2)20-48-36(46)41-27-17-25(33(30(37)18-27)47-14-13-43-12-4-5-31(43)44)19-42(3)35(45)32(24)40-26-7-9-29-23(16-26)10-11-39-34(29)38/h6-11,15-18,22,32,40H,4-5,12-14,19-20H2,1-3H3,(H2,38,39)(H,41,46)/t22-,32+/m0/s1
Reactome pathway
US Patent
210n/an/an/an/an/an/a7.4n/a
Bristol-Myers Squibb Company
US Patent
Assay Description
Tissue kallikrein-1 (37° C) activity was determined in reactions containing 0.05 nM enzyme and 90 μM substrate (H-D-Val-Leu-Arg-AFC) in buffer (...
US Patent US9174974 (2015)
BindingDB Entry DOI: 10.7270/Q2W37V32