null
SMILES: CCC1(O)CCC(CNc2ccc(cc2[N+]([O-])=O)S(=O)(=O)NC(=O)c2ccc(cc2Oc2cnc3[nH]ccc3c2)N2CCN(CC3=C(CC(C)(C)CC3)c3ccc(Cl)cc3)CC2)CC1
InChI Key: InChIKey=HGCQJSCVVNLDMQ-UHFFFAOYSA-N
Activity Spreadsheet -- Enzyme Inhibition Constant Data from BindingDB
Found 3 hits for monomerid = 189786
Trg + Lig
Ki
nM
ΔG°
kcal/mole
IC50
nM
Kd
nM
EC50/IC50
nM
koff
s-1
kon
M-1s-1
pHTemp
°C
Apoptosis regulator Bcl-2
(Homo sapiens (Human))
BDBM189786
(US11369599, Compound 359 | US9174982, 358)
Show SMILES CCC1(O)CCC(CNc2ccc(cc2[N+]([O-])=O)S(=O)(=O)NC(=O)c2ccc(cc2Oc2cnc3[nH]ccc3c2)N2CCN(CC3=C(CC(C)(C)CC3)c3ccc(Cl)cc3)CC2)CC1 |t:49,(-12.08,6.12,;-10.77,6.93,;-9.41,6.21,;-10.77,5.49,;-8.64,4.88,;-7.1,4.88,;-6.33,6.21,;-4.79,6.21,;-4.02,7.55,;-2.48,7.55,;-1.71,6.21,;-.17,6.21,;.6,7.55,;-.17,8.88,;-1.71,8.88,;-2.48,10.21,;-1.71,11.55,;-4.02,10.21,;2.14,7.55,;2.14,9.09,;3.68,7.55,;2.14,6.01,;3.47,5.24,;4.81,6.01,;3.47,3.7,;4.81,2.93,;4.81,1.39,;3.47,.62,;2.14,1.39,;2.14,2.93,;.81,3.7,;-.53,2.93,;-.53,1.39,;-1.86,.62,;-3.19,1.39,;-4.66,.91,;-5.56,2.16,;-4.66,3.4,;-3.19,2.93,;-1.86,3.7,;3.47,-.92,;4.81,-1.69,;4.81,-3.23,;3.47,-4,;3.47,-5.54,;4.81,-6.31,;4.81,-7.85,;6.14,-8.62,;7.48,-7.85,;8.29,-9.16,;9.01,-7.91,;7.48,-6.31,;6.14,-5.54,;3.47,-8.62,;3.47,-10.16,;2.14,-10.93,;.81,-10.16,;-.53,-10.93,;.81,-8.62,;2.14,-7.85,;2.14,-3.23,;2.14,-1.69,;-7.1,7.55,;-8.64,7.55,)|
Show InChI InChI=1S/C48H56ClN7O7S/c1-4-48(58)18-13-32(14-19-48)29-51-42-12-10-39(27-43(42)56(59)60)64(61,62)53-46(57)40-11-9-37(26-44(40)63-38-25-34-16-20-50-45(34)52-30-38)55-23-21-54(22-24-55)31-35-15-17-47(2,3)28-41(35)33-5-7-36(49)8-6-33/h5-12,16,20,25-27,30,32,51,58H,4,13-15,17-19,21-24,28-29,31H2,1-3H3,(H,50,52)(H,53,57)
US Patent
<0.0100<-15.0n/an/an/an/an/an/a25
ABBVIE INC.; GENENTECH, INC.; THE WALTER AND ELIZA HALL INSTITUTE OF MEDICAL RESEARCH
US Patent
Assay Description
Representative compounds were serially diluted in dimethyl sulfoxide (DMSO) starting at 50 uM (2x starting concentration; 10% DMSO) and 10 uL were tr...
US Patent US9174982 (2015)
BindingDB Entry DOI: 10.7270/Q2RB73D5
Apoptosis regulator Bcl-2
(Homo sapiens (Human))
BDBM189786
(US11369599, Compound 359 | US9174982, 358)
Show SMILES CCC1(O)CCC(CNc2ccc(cc2[N+]([O-])=O)S(=O)(=O)NC(=O)c2ccc(cc2Oc2cnc3[nH]ccc3c2)N2CCN(CC3=C(CC(C)(C)CC3)c3ccc(Cl)cc3)CC2)CC1 |t:49,(-12.08,6.12,;-10.77,6.93,;-9.41,6.21,;-10.77,5.49,;-8.64,4.88,;-7.1,4.88,;-6.33,6.21,;-4.79,6.21,;-4.02,7.55,;-2.48,7.55,;-1.71,6.21,;-.17,6.21,;.6,7.55,;-.17,8.88,;-1.71,8.88,;-2.48,10.21,;-1.71,11.55,;-4.02,10.21,;2.14,7.55,;2.14,9.09,;3.68,7.55,;2.14,6.01,;3.47,5.24,;4.81,6.01,;3.47,3.7,;4.81,2.93,;4.81,1.39,;3.47,.62,;2.14,1.39,;2.14,2.93,;.81,3.7,;-.53,2.93,;-.53,1.39,;-1.86,.62,;-3.19,1.39,;-4.66,.91,;-5.56,2.16,;-4.66,3.4,;-3.19,2.93,;-1.86,3.7,;3.47,-.92,;4.81,-1.69,;4.81,-3.23,;3.47,-4,;3.47,-5.54,;4.81,-6.31,;4.81,-7.85,;6.14,-8.62,;7.48,-7.85,;8.29,-9.16,;9.01,-7.91,;7.48,-6.31,;6.14,-5.54,;3.47,-8.62,;3.47,-10.16,;2.14,-10.93,;.81,-10.16,;-.53,-10.93,;.81,-8.62,;2.14,-7.85,;2.14,-3.23,;2.14,-1.69,;-7.1,7.55,;-8.64,7.55,)|
Show InChI InChI=1S/C48H56ClN7O7S/c1-4-48(58)18-13-32(14-19-48)29-51-42-12-10-39(27-43(42)56(59)60)64(61,62)53-46(57)40-11-9-37(26-44(40)63-38-25-34-16-20-50-45(34)52-30-38)55-23-21-54(22-24-55)31-35-15-17-47(2,3)28-41(35)33-5-7-36(49)8-6-33/h5-12,16,20,25-27,30,32,51,58H,4,13-15,17-19,21-24,28-29,31H2,1-3H3,(H,50,52)(H,53,57)
<0.0100n/an/an/an/an/an/an/an/a
TBA
Citation and Details
Apoptosis regulator Bcl-2
(Homo sapiens (Human))
BDBM189786
(US11369599, Compound 359 | US9174982, 358)
Show SMILES CCC1(O)CCC(CNc2ccc(cc2[N+]([O-])=O)S(=O)(=O)NC(=O)c2ccc(cc2Oc2cnc3[nH]ccc3c2)N2CCN(CC3=C(CC(C)(C)CC3)c3ccc(Cl)cc3)CC2)CC1 |t:49,(-12.08,6.12,;-10.77,6.93,;-9.41,6.21,;-10.77,5.49,;-8.64,4.88,;-7.1,4.88,;-6.33,6.21,;-4.79,6.21,;-4.02,7.55,;-2.48,7.55,;-1.71,6.21,;-.17,6.21,;.6,7.55,;-.17,8.88,;-1.71,8.88,;-2.48,10.21,;-1.71,11.55,;-4.02,10.21,;2.14,7.55,;2.14,9.09,;3.68,7.55,;2.14,6.01,;3.47,5.24,;4.81,6.01,;3.47,3.7,;4.81,2.93,;4.81,1.39,;3.47,.62,;2.14,1.39,;2.14,2.93,;.81,3.7,;-.53,2.93,;-.53,1.39,;-1.86,.62,;-3.19,1.39,;-4.66,.91,;-5.56,2.16,;-4.66,3.4,;-3.19,2.93,;-1.86,3.7,;3.47,-.92,;4.81,-1.69,;4.81,-3.23,;3.47,-4,;3.47,-5.54,;4.81,-6.31,;4.81,-7.85,;6.14,-8.62,;7.48,-7.85,;8.29,-9.16,;9.01,-7.91,;7.48,-6.31,;6.14,-5.54,;3.47,-8.62,;3.47,-10.16,;2.14,-10.93,;.81,-10.16,;-.53,-10.93,;.81,-8.62,;2.14,-7.85,;2.14,-3.23,;2.14,-1.69,;-7.1,7.55,;-8.64,7.55,)|
Show InChI InChI=1S/C48H56ClN7O7S/c1-4-48(58)18-13-32(14-19-48)29-51-42-12-10-39(27-43(42)56(59)60)64(61,62)53-46(57)40-11-9-37(26-44(40)63-38-25-34-16-20-50-45(34)52-30-38)55-23-21-54(22-24-55)31-35-15-17-47(2,3)28-41(35)33-5-7-36(49)8-6-33/h5-12,16,20,25-27,30,32,51,58H,4,13-15,17-19,21-24,28-29,31H2,1-3H3,(H,50,52)(H,53,57)
<0.0100n/an/an/an/an/an/an/an/a
TBA
Citation and Details