null
SMILES: CC1(C)CCC(CN2CCN(CC2)c2ccc(C(=O)NS(=O)(=O)c3ccc(NC[C@H]4CN(CCO4)C4COC4)c(c3)[N+]([O-])=O)c(Oc3cnc4[nH]ccc4c3)c2)=C(C1)c1ccc(Cl)cc1
InChI Key: InChIKey=PAJFYMAFPSCIJF-LHEWISCISA-N
Activity Spreadsheet -- Enzyme Inhibition Constant Data from BindingDB
Found 3 hits for monomerid = 189788
Trg + Lig
Ki
nM
ΔG°
kcal/mole
IC50
nM
Kd
nM
EC50/IC50
nM
koff
s-1
kon
M-1s-1
pHTemp
°C
Apoptosis regulator Bcl-2
(Homo sapiens (Human))
BDBM189788
(US10213433, Compound 361 | US11369599, Compound 36...)
Show SMILES CC1(C)CCC(CN2CCN(CC2)c2ccc(C(=O)NS(=O)(=O)c3ccc(NC[C@H]4CN(CCO4)C4COC4)c(c3)[N+]([O-])=O)c(Oc3cnc4[nH]ccc4c3)c2)=C(C1)c1ccc(Cl)cc1 |c:62|
Show InChI InChI=1S/C47H53ClN8O8S/c1-47(2)13-11-33(41(24-47)31-3-5-34(48)6-4-31)27-53-15-17-54(18-16-53)35-7-9-40(44(22-35)64-37-21-32-12-14-49-45(32)51-25-37)46(57)52-65(60,61)39-8-10-42(43(23-39)56(58)59)50-26-38-28-55(19-20-63-38)36-29-62-30-36/h3-10,12,14,21-23,25,36,38,50H,11,13,15-20,24,26-30H2,1-2H3,(H,49,51)(H,52,57)/t38-/m0/s1
US Patent
<0.0100<-15.0n/an/an/an/an/an/a25
ABBVIE INC.; GENENTECH, INC.; THE WALTER AND ELIZA HALL INSTITUTE OF MEDICAL RESEARCH
US Patent
Assay Description
Representative compounds were serially diluted in dimethyl sulfoxide (DMSO) starting at 50 uM (2x starting concentration; 10% DMSO) and 10 uL were tr...
US Patent US9174982 (2015)
BindingDB Entry DOI: 10.7270/Q2RB73D5
Apoptosis regulator Bcl-2
(Homo sapiens (Human))
BDBM189788
(US10213433, Compound 361 | US11369599, Compound 36...)
Show SMILES CC1(C)CCC(CN2CCN(CC2)c2ccc(C(=O)NS(=O)(=O)c3ccc(NC[C@H]4CN(CCO4)C4COC4)c(c3)[N+]([O-])=O)c(Oc3cnc4[nH]ccc4c3)c2)=C(C1)c1ccc(Cl)cc1 |c:62|
Show InChI InChI=1S/C47H53ClN8O8S/c1-47(2)13-11-33(41(24-47)31-3-5-34(48)6-4-31)27-53-15-17-54(18-16-53)35-7-9-40(44(22-35)64-37-21-32-12-14-49-45(32)51-25-37)46(57)52-65(60,61)39-8-10-42(43(23-39)56(58)59)50-26-38-28-55(19-20-63-38)36-29-62-30-36/h3-10,12,14,21-23,25,36,38,50H,11,13,15-20,24,26-30H2,1-2H3,(H,49,51)(H,52,57)/t38-/m0/s1
<0.0100n/an/an/an/an/an/an/an/a
TBA
Citation and Details
Apoptosis regulator Bcl-2
(Homo sapiens (Human))
BDBM189788
(US10213433, Compound 361 | US11369599, Compound 36...)
Show SMILES CC1(C)CCC(CN2CCN(CC2)c2ccc(C(=O)NS(=O)(=O)c3ccc(NC[C@H]4CN(CCO4)C4COC4)c(c3)[N+]([O-])=O)c(Oc3cnc4[nH]ccc4c3)c2)=C(C1)c1ccc(Cl)cc1 |c:62|
Show InChI InChI=1S/C47H53ClN8O8S/c1-47(2)13-11-33(41(24-47)31-3-5-34(48)6-4-31)27-53-15-17-54(18-16-53)35-7-9-40(44(22-35)64-37-21-32-12-14-49-45(32)51-25-37)46(57)52-65(60,61)39-8-10-42(43(23-39)56(58)59)50-26-38-28-55(19-20-63-38)36-29-62-30-36/h3-10,12,14,21-23,25,36,38,50H,11,13,15-20,24,26-30H2,1-2H3,(H,49,51)(H,52,57)/t38-/m0/s1
US Patent
<0.0100n/an/an/an/an/an/an/an/a
AbbVie Inc.
US Patent
Assay Description
TR-FRET (Time-Resolved Fluorescence-Resonance-Energy-Transfer) assay.
US Patent US10213433 (2019)
BindingDB Entry DOI: 10.7270/Q23F4RZ6