BDBM190179 EPZ005030::US10273223, Compound A-2::US9175331, 4::US9637472, Compound A-2
SMILES: CC(C)n1ncc2c(cc(nc12)-c1ccc(CN2CCOCC2)cc1)C(=O)NCc1c(C)cc(C)[nH]c1=O
InChI Key: InChIKey=WGDUEUOSWFHQIH-UHFFFAOYSA-N
Data: 8 IC50  1 EC50
Activity Spreadsheet -- Enzyme Inhibition Constant Data from BindingDB
Found 10 hits for monomerid = 190179
Trg + Lig
Ki
nM
ΔG°
kcal/mole
IC50
nM
Kd
nM
EC50/IC50
nM
koff
s-1
kon
M-1s-1
pHTemp
°C
Histone-lysine N-methyltransferase EZH2
(Homo sapiens (Human))
BDBM190179
(EPZ005030 | US10273223, Compound A-2 | US9175331, ...)
Show SMILES CC(C)n1ncc2c(cc(nc12)-c1ccc(CN2CCOCC2)cc1)C(=O)NCc1c(C)cc(C)[nH]c1=O
Show InChI InChI=1S/C29H34N6O3/c1-18(2)35-27-25(16-31-35)23(28(36)30-15-24-19(3)13-20(4)32-29(24)37)14-26(33-27)22-7-5-21(6-8-22)17-34-9-11-38-12-10-34/h5-8,13-14,16,18H,9-12,15,17H2,1-4H3,(H,30,36)(H,32,37)
180n/an/an/an/an/an/an/an/a
TBA
Citation and Details
EZH2(Y641F)
(Homo sapiens (Human))
BDBM190179
(EPZ005030 | US10273223, Compound A-2 | US9175331, ...)
Show SMILES CC(C)n1ncc2c(cc(nc12)-c1ccc(CN2CCOCC2)cc1)C(=O)NCc1c(C)cc(C)[nH]c1=O
Show InChI InChI=1S/C29H34N6O3/c1-18(2)35-27-25(16-31-35)23(28(36)30-15-24-19(3)13-20(4)32-29(24)37)14-26(33-27)22-7-5-21(6-8-22)17-34-9-11-38-12-10-34/h5-8,13-14,16,18H,9-12,15,17H2,1-4H3,(H,30,36)(H,32,37)
US Patent
n/an/a 185n/an/an/an/an/an/a
Epizyme, Inc.
US Patent
Assay Description
Test compounds were serially diluted 3-fold in DMSO in a 10 point-curve and 1 uL was spotted into a 384-well microplate in duplicate using a Platemat...
US Patent US9175331 (2015)
BindingDB Entry DOI: 10.7270/Q2ZW1JQP
Histone-lysine N-methyltransferase EZH2 (A677G)
(Homo sapiens (Human))
BDBM190179
(EPZ005030 | US10273223, Compound A-2 | US9175331, ...)
Show SMILES CC(C)n1ncc2c(cc(nc12)-c1ccc(CN2CCOCC2)cc1)C(=O)NCc1c(C)cc(C)[nH]c1=O
Show InChI InChI=1S/C29H34N6O3/c1-18(2)35-27-25(16-31-35)23(28(36)30-15-24-19(3)13-20(4)32-29(24)37)14-26(33-27)22-7-5-21(6-8-22)17-34-9-11-38-12-10-34/h5-8,13-14,16,18H,9-12,15,17H2,1-4H3,(H,30,36)(H,32,37)
US Patent
n/an/a 41.8n/an/an/an/an/an/a
Epizyme, Inc.
US Patent
Assay Description
Test compounds were serially diluted 3-fold in DMSO in a 10 point-curve and 1 uL was spotted into a 384-well microplate in duplicate using a Platemat...
US Patent US9175331 (2015)
BindingDB Entry DOI: 10.7270/Q2ZW1JQP
Histone-lysine N-methyltransferase EZH2 (A687V)
(Homo sapiens (Human))
BDBM190179
(EPZ005030 | US10273223, Compound A-2 | US9175331, ...)
Show SMILES CC(C)n1ncc2c(cc(nc12)-c1ccc(CN2CCOCC2)cc1)C(=O)NCc1c(C)cc(C)[nH]c1=O
Show InChI InChI=1S/C29H34N6O3/c1-18(2)35-27-25(16-31-35)23(28(36)30-15-24-19(3)13-20(4)32-29(24)37)14-26(33-27)22-7-5-21(6-8-22)17-34-9-11-38-12-10-34/h5-8,13-14,16,18H,9-12,15,17H2,1-4H3,(H,30,36)(H,32,37)
US Patent
n/an/a 50.4n/an/an/an/an/an/a
Epizyme, Inc.
US Patent
Assay Description
Test compounds were serially diluted 3-fold in DMSO in a 10 point-curve and 1 uL was spotted into a 384-well microplate in duplicate using a Platemat...
US Patent US9175331 (2015)
BindingDB Entry DOI: 10.7270/Q2ZW1JQP
Histone-lysine N-methyltransferase EZH2
(Homo sapiens (Human))
BDBM190179
(EPZ005030 | US10273223, Compound A-2 | US9175331, ...)
Show SMILES CC(C)n1ncc2c(cc(nc12)-c1ccc(CN2CCOCC2)cc1)C(=O)NCc1c(C)cc(C)[nH]c1=O
Show InChI InChI=1S/C29H34N6O3/c1-18(2)35-27-25(16-31-35)23(28(36)30-15-24-19(3)13-20(4)32-29(24)37)14-26(33-27)22-7-5-21(6-8-22)17-34-9-11-38-12-10-34/h5-8,13-14,16,18H,9-12,15,17H2,1-4H3,(H,30,36)(H,32,37)
n/an/a>3.00E+3n/an/an/an/an/an/a
Epizyme
Curated by ChEMBL
Assay Description
Inhibition of methyltransferase activity of EZH2 in human lymphoma cells assessed as H3K27 methylation
J Med Chem 59: 1556-64 (2016)
BindingDB Entry DOI: 10.7270/Q2B56MM7
Histone-lysine N-methyltransferase EZH2
(Homo sapiens (Human))
BDBM190179
(EPZ005030 | US10273223, Compound A-2 | US9175331, ...)
Show SMILES CC(C)n1ncc2c(cc(nc12)-c1ccc(CN2CCOCC2)cc1)C(=O)NCc1c(C)cc(C)[nH]c1=O
Show InChI InChI=1S/C29H34N6O3/c1-18(2)35-27-25(16-31-35)23(28(36)30-15-24-19(3)13-20(4)32-29(24)37)14-26(33-27)22-7-5-21(6-8-22)17-34-9-11-38-12-10-34/h5-8,13-14,16,18H,9-12,15,17H2,1-4H3,(H,30,36)(H,32,37)
n/an/a 400n/an/an/an/an/an/a
Epizyme
Curated by ChEMBL
Assay Description
Inhibition of methyltransferase activity of human EZH2 using chicken oligonucleotide as substrate by pull down assay
J Med Chem 59: 1556-64 (2016)
BindingDB Entry DOI: 10.7270/Q2B56MM7
Histone-lysine N-methyltransferase EZH2
(Homo sapiens (Human))
BDBM190179
(EPZ005030 | US10273223, Compound A-2 | US9175331, ...)
Show SMILES CC(C)n1ncc2c(cc(nc12)-c1ccc(CN2CCOCC2)cc1)C(=O)NCc1c(C)cc(C)[nH]c1=O
Show InChI InChI=1S/C29H34N6O3/c1-18(2)35-27-25(16-31-35)23(28(36)30-15-24-19(3)13-20(4)32-29(24)37)14-26(33-27)22-7-5-21(6-8-22)17-34-9-11-38-12-10-34/h5-8,13-14,16,18H,9-12,15,17H2,1-4H3,(H,30,36)(H,32,37)
US Patent
n/an/a 650n/an/an/an/an/an/a
Epizyme, Inc.
US Patent
Assay Description
Recombinant PRC2 Enzymes. Human PRC2 enzymes were purified as 4-component enzyme complexes co-expressed in Spodoptera frugiperda (sf9) cells using a ...
US Patent US9637472 (2017)
BindingDB Entry DOI: 10.7270/Q2X0693B
Histone-lysine N-methyltransferase EZH2
(Homo sapiens (Human))
BDBM190179
(EPZ005030 | US10273223, Compound A-2 | US9175331, ...)
Show SMILES CC(C)n1ncc2c(cc(nc12)-c1ccc(CN2CCOCC2)cc1)C(=O)NCc1c(C)cc(C)[nH]c1=O
Show InChI InChI=1S/C29H34N6O3/c1-18(2)35-27-25(16-31-35)23(28(36)30-15-24-19(3)13-20(4)32-29(24)37)14-26(33-27)22-7-5-21(6-8-22)17-34-9-11-38-12-10-34/h5-8,13-14,16,18H,9-12,15,17H2,1-4H3,(H,30,36)(H,32,37)
US Patent
n/an/a 650n/an/an/an/an/an/a
IRBM/Merck
Assay Description
eneral Procedure for Wild-Type PRC2 Enzyme Assay on Oligonucleosome Substrate. The assays was performed in a buffer consisting of 20 mM bicine (pH=7....
J Med Chem 51: 2350-3 (2008)
BindingDB Entry DOI: 10.7270/Q28P62V9
Histone-lysine N-methyltransferase EZH2
(Homo sapiens (Human))
BDBM190179
(EPZ005030 | US10273223, Compound A-2 | US9175331, ...)
Show SMILES CC(C)n1ncc2c(cc(nc12)-c1ccc(CN2CCOCC2)cc1)C(=O)NCc1c(C)cc(C)[nH]c1=O
Show InChI InChI=1S/C29H34N6O3/c1-18(2)35-27-25(16-31-35)23(28(36)30-15-24-19(3)13-20(4)32-29(24)37)14-26(33-27)22-7-5-21(6-8-22)17-34-9-11-38-12-10-34/h5-8,13-14,16,18H,9-12,15,17H2,1-4H3,(H,30,36)(H,32,37)
US Patent
n/an/a 260n/an/an/an/an/an/a
Epizyme, Inc.
US Patent
Assay Description
Test compounds were serially diluted 3-fold in DMSO in a 10 point-curve and 1 uL was spotted into a 384-well microplate in duplicate using a Platemat...
US Patent US9175331 (2015)
BindingDB Entry DOI: 10.7270/Q2ZW1JQP
Histone-lysine N-methyltransferase EZH2
(Homo sapiens (Human))
BDBM190179
(EPZ005030 | US10273223, Compound A-2 | US9175331, ...)
Show SMILES CC(C)n1ncc2c(cc(nc12)-c1ccc(CN2CCOCC2)cc1)C(=O)NCc1c(C)cc(C)[nH]c1=O
Show InChI InChI=1S/C29H34N6O3/c1-18(2)35-27-25(16-31-35)23(28(36)30-15-24-19(3)13-20(4)32-29(24)37)14-26(33-27)22-7-5-21(6-8-22)17-34-9-11-38-12-10-34/h5-8,13-14,16,18H,9-12,15,17H2,1-4H3,(H,30,36)(H,32,37)
n/an/an/an/a 1.05E+4n/an/an/an/a
Epizyme
Curated by ChEMBL
Assay Description
Inhibition of methyltransferase activity of EZH2 in human G401 cells assessed as H3K27 trimethylation after 4 hrs by ELISA
J Med Chem 59: 1556-64 (2016)
BindingDB Entry DOI: 10.7270/Q2B56MM7