null
SMILES: CCN([C@H]1CC[C@@H](CC1)N(C)C)c1cc(cc(C(=O)NCc2c(C)cc(C)[nH]c2=O)c1C)S(=O)(=O)CC
InChI Key:
Activity Spreadsheet -- Enzyme Inhibition Constant Data from BindingDB
Found 4 hits for monomerid = 190194
Trg + Lig
Ki
nM
ΔG°
kcal/mole
IC50
nM
Kd
nM
EC50/IC50
nM
koff
s-1
kon
M-1s-1
pHTemp
°C
Histone-lysine N-methyltransferase EZH2
(Homo sapiens (Human))
BDBM190194
(EPZ007789 | US9175331, 22)
Show SMILES CCN([C@H]1CC[C@@H](CC1)N(C)C)c1cc(cc(C(=O)NCc2c(C)cc(C)[nH]c2=O)c1C)S(=O)(=O)CC |r,wU:3.2,wD:6.9,(-5.33,3.08,;-5.33,1.54,;-4,.77,;-4,-.77,;-2.67,-1.54,;-2.67,-3.08,;-4,-3.85,;-5.33,-3.08,;-5.33,-1.54,;-4,-5.39,;-2.67,-6.16,;-5.33,-6.16,;-2.67,1.54,;-2.67,3.08,;-1.33,3.85,;,3.08,;,1.54,;1.33,.77,;2.67,1.54,;1.33,-.77,;2.67,-1.54,;2.67,-3.08,;4,-3.85,;5.33,-3.08,;4,-5.39,;2.67,-6.16,;2.67,-7.7,;1.33,-5.39,;1.33,-3.85,;,-3.08,;-1.33,.77,;-1.33,-.77,;-1.33,5.39,;.21,5.39,;-2.87,5.39,;-1.33,6.93,;,7.7,)|
US Patent
n/an/a 10.8n/an/an/an/an/an/a
Epizyme, Inc.
US Patent
Assay Description
Test compounds were serially diluted 3-fold in DMSO in a 10 point-curve and 1 uL was spotted into a 384-well microplate in duplicate using a Platemat...
US Patent US9175331 (2015)
BindingDB Entry DOI: 10.7270/Q2ZW1JQP
Histone-lysine N-methyltransferase EZH2 [A687V]
(Homo sapiens (Human))
BDBM190194
(EPZ007789 | US9175331, 22)
Show SMILES CCN([C@H]1CC[C@@H](CC1)N(C)C)c1cc(cc(C(=O)NCc2c(C)cc(C)[nH]c2=O)c1C)S(=O)(=O)CC |r,wU:3.2,wD:6.9,(-5.33,3.08,;-5.33,1.54,;-4,.77,;-4,-.77,;-2.67,-1.54,;-2.67,-3.08,;-4,-3.85,;-5.33,-3.08,;-5.33,-1.54,;-4,-5.39,;-2.67,-6.16,;-5.33,-6.16,;-2.67,1.54,;-2.67,3.08,;-1.33,3.85,;,3.08,;,1.54,;1.33,.77,;2.67,1.54,;1.33,-.77,;2.67,-1.54,;2.67,-3.08,;4,-3.85,;5.33,-3.08,;4,-5.39,;2.67,-6.16,;2.67,-7.7,;1.33,-5.39,;1.33,-3.85,;,-3.08,;-1.33,.77,;-1.33,-.77,;-1.33,5.39,;.21,5.39,;-2.87,5.39,;-1.33,6.93,;,7.7,)|
US Patent
n/an/a 5.10n/an/an/an/an/an/a
Epizyme, Inc.
US Patent
Assay Description
Test compounds were serially diluted 3-fold in DMSO in a 10 point-curve and 1 uL was spotted into a 384-well microplate in duplicate using a Platemat...
US Patent US9175331 (2015)
BindingDB Entry DOI: 10.7270/Q2ZW1JQP
Histone-lysine N-methyltransferase EZH2 [A677G]
(Homo sapiens (Human))
BDBM190194
(EPZ007789 | US9175331, 22)
Show SMILES CCN([C@H]1CC[C@@H](CC1)N(C)C)c1cc(cc(C(=O)NCc2c(C)cc(C)[nH]c2=O)c1C)S(=O)(=O)CC |r,wU:3.2,wD:6.9,(-5.33,3.08,;-5.33,1.54,;-4,.77,;-4,-.77,;-2.67,-1.54,;-2.67,-3.08,;-4,-3.85,;-5.33,-3.08,;-5.33,-1.54,;-4,-5.39,;-2.67,-6.16,;-5.33,-6.16,;-2.67,1.54,;-2.67,3.08,;-1.33,3.85,;,3.08,;,1.54,;1.33,.77,;2.67,1.54,;1.33,-.77,;2.67,-1.54,;2.67,-3.08,;4,-3.85,;5.33,-3.08,;4,-5.39,;2.67,-6.16,;2.67,-7.7,;1.33,-5.39,;1.33,-3.85,;,-3.08,;-1.33,.77,;-1.33,-.77,;-1.33,5.39,;.21,5.39,;-2.87,5.39,;-1.33,6.93,;,7.7,)|
US Patent
n/an/a 4.80n/an/an/an/an/an/a
Epizyme, Inc.
US Patent
Assay Description
Test compounds were serially diluted 3-fold in DMSO in a 10 point-curve and 1 uL was spotted into a 384-well microplate in duplicate using a Platemat...
US Patent US9175331 (2015)
BindingDB Entry DOI: 10.7270/Q2ZW1JQP
Histone-lysine N-methyltransferase EZH2 [Y641F]
(Homo sapiens (Human))
BDBM190194
(EPZ007789 | US9175331, 22)
Show SMILES CCN([C@H]1CC[C@@H](CC1)N(C)C)c1cc(cc(C(=O)NCc2c(C)cc(C)[nH]c2=O)c1C)S(=O)(=O)CC |r,wU:3.2,wD:6.9,(-5.33,3.08,;-5.33,1.54,;-4,.77,;-4,-.77,;-2.67,-1.54,;-2.67,-3.08,;-4,-3.85,;-5.33,-3.08,;-5.33,-1.54,;-4,-5.39,;-2.67,-6.16,;-5.33,-6.16,;-2.67,1.54,;-2.67,3.08,;-1.33,3.85,;,3.08,;,1.54,;1.33,.77,;2.67,1.54,;1.33,-.77,;2.67,-1.54,;2.67,-3.08,;4,-3.85,;5.33,-3.08,;4,-5.39,;2.67,-6.16,;2.67,-7.7,;1.33,-5.39,;1.33,-3.85,;,-3.08,;-1.33,.77,;-1.33,-.77,;-1.33,5.39,;.21,5.39,;-2.87,5.39,;-1.33,6.93,;,7.7,)|
US Patent
n/an/a 11.4n/an/an/an/an/an/a
Epizyme, Inc.
US Patent
Assay Description
Test compounds were serially diluted 3-fold in DMSO in a 10 point-curve and 1 uL was spotted into a 384-well microplate in duplicate using a Platemat...
US Patent US9175331 (2015)
BindingDB Entry DOI: 10.7270/Q2ZW1JQP