BDBM190534 US9181184, 20
SMILES: COCCN1C[C@H](O)[C@@H](O)[C@H](O)[C@H]1CO
InChI Key: InChIKey=YBMODUHFDUDCBF-BZNPZCIMSA-N
Data: 1 EC50
Activity Spreadsheet -- Enzyme Inhibition Constant Data from BindingDB
Found 1 hit for monomerid = 190534
Trg + Lig
Ki
nM
ΔG°
kcal/mole
IC50
nM
Kd
nM
EC50/IC50
nM
koff
s-1
kon
M-1s-1
pHTemp
°C
alpha-glucosidase (Gaa)
(Mus musculus (Mouse))
BDBM190534
(US9181184, 20)
Show SMILES COCCN1C[C@H](O)[C@@H](O)[C@H](O)[C@H]1CO |r|
Show InChI InChI=1S/C9H19NO5/c1-15-3-2-10-4-7(12)9(14)8(13)6(10)5-11/h6-9,11-14H,2-5H2,1H3/t6-,7+,8-,9-/m1/s1
US Patent
n/an/an/an/a 4.68E+5n/an/a4.0n/a
Amicus Therapeutics, Inc.
US Patent
Assay Description
Cells were washed two times with 200 μL dPBS followed by the addition of 70 μL of substrate (2.11 mM 3 mM 4-MU-α-D-glu) in citrate-pho...
US Patent US9181184 (2015)
BindingDB Entry DOI: 10.7270/Q2T43RWB