BDBM191045 US9181253, 108
SMILES: O[C@H]1C[C@]2(C[C@H]2[C@H]1O)n1cnc2c(NC3CC3)nc(Cl)nc12
InChI Key: InChIKey=CEIXIMCVWLWYRD-AGZVQKLTSA-N
Data: 3 KI
Activity Spreadsheet -- Enzyme Inhibition Constant Data from BindingDB
Found 3 hits for monomerid = 191045
Trg + Lig
Ki
nM
ΔG°
kcal/mole
IC50
nM
Kd
nM
EC50/IC50
nM
koff
s-1
kon
M-1s-1
pHTemp
°C
Adenosine receptor A3
(Homo sapiens (Human))
BDBM191045
(US9181253, 108)
Show SMILES O[C@H]1C[C@]2(C[C@H]2[C@H]1O)n1cnc2c(NC3CC3)nc(Cl)nc12 |r|
Show InChI InChI=1S/C14H16ClN5O2/c15-13-18-11(17-6-1-2-6)9-12(19-13)20(5-16-9)14-3-7(14)10(22)8(21)4-14/h5-8,10,21-22H,1-4H2,(H,17,18,19)/t7-,8-,10+,14-/m0/s1
US Patent
12.1 -10.8n/an/an/an/an/a7.525
The United States of America, as represented by the Secretary, Department of Health and Human Services
US Patent
Assay Description
Radioligand binding assays at A1, A2A, and A3ARs were performed according to the procedures described previously. Each tube in the binding assay cont...
US Patent US9181253 (2015)
BindingDB Entry DOI: 10.7270/Q2CV4GJ4
Adenosine receptor A1
(Homo sapiens (Human))
BDBM191045
(US9181253, 108)
Show SMILES O[C@H]1C[C@]2(C[C@H]2[C@H]1O)n1cnc2c(NC3CC3)nc(Cl)nc12 |r|
Show InChI InChI=1S/C14H16ClN5O2/c15-13-18-11(17-6-1-2-6)9-12(19-13)20(5-16-9)14-3-7(14)10(22)8(21)4-14/h5-8,10,21-22H,1-4H2,(H,17,18,19)/t7-,8-,10+,14-/m0/s1
Reactome pathway
US Patent
210 -9.10n/an/an/an/an/a7.525
The United States of America, as represented by the Secretary, Department of Health and Human Services
US Patent
Assay Description
Radioligand binding assays at A1, A2A, and A3ARs were performed according to the procedures described previously. Each tube in the binding assay cont...
US Patent US9181253 (2015)
BindingDB Entry DOI: 10.7270/Q2CV4GJ4
Adenosine receptor A2a
(Homo sapiens (Human))
BDBM191045
(US9181253, 108)
Show SMILES O[C@H]1C[C@]2(C[C@H]2[C@H]1O)n1cnc2c(NC3CC3)nc(Cl)nc12 |r|
Show InChI InChI=1S/C14H16ClN5O2/c15-13-18-11(17-6-1-2-6)9-12(19-13)20(5-16-9)14-3-7(14)10(22)8(21)4-14/h5-8,10,21-22H,1-4H2,(H,17,18,19)/t7-,8-,10+,14-/m0/s1
NCI pathway
Reactome pathway
US Patent
3.70E+3 -7.40n/an/an/an/an/a7.525
The United States of America, as represented by the Secretary, Department of Health and Human Services
US Patent
Assay Description
Radioligand binding assays at A1, A2A, and A3ARs were performed according to the procedures described previously. Each tube in the binding assay cont...
US Patent US9181253 (2015)
BindingDB Entry DOI: 10.7270/Q2CV4GJ4