null
SMILES: NCC[C@H]1CNC(=O)c2cc(c(-c3ccc(O)cc3)n12)-c1cccc(OC(F)(F)F)c1
InChI Key: InChIKey=ZPLLNNATQWKVGY-HNNXBMFYSA-N
Activity Spreadsheet -- Enzyme Inhibition Constant Data from BindingDB
Found 2 hits for monomerid = 191095
Trg + Lig
Ki
nM
ΔG°
kcal/mole
IC50
nM
Kd
nM
EC50/IC50
nM
koff
s-1
kon
M-1s-1
pHTemp
°C
Serine/threonine-protein kinase pim-2
(Homo sapiens (Human))
BDBM191095
(US9181258, 93)
Show SMILES NCC[C@H]1CNC(=O)c2cc(c(-c3ccc(O)cc3)n12)-c1cccc(OC(F)(F)F)c1
Show InChI InChI=1S/C22H20F3N3O3/c23-22(24,25)31-17-3-1-2-14(10-17)18-11-19-21(30)27-12-15(8-9-26)28(19)20(18)13-4-6-16(29)7-5-13/h1-7,10-11,15,29H,8-9,12,26H2,(H,27,30)/t15-/m0/s1
US Patent
n/an/a 16n/an/an/an/a7.5n/a
NERVIANO MEDICAL SCIENCES S.R.L.
US Patent
Assay Description
The inhibitory activity of putative kinase inhibitors and the potency of selected compounds were determined using a trans-phosphorylation assay.Speci...
US Patent US9181258 (2015)
BindingDB Entry DOI: 10.7270/Q2862F7F
Serine/threonine-protein kinase pim-1
(Homo sapiens (Human))
BDBM191095
(US9181258, 93)
Show SMILES NCC[C@H]1CNC(=O)c2cc(c(-c3ccc(O)cc3)n12)-c1cccc(OC(F)(F)F)c1
Show InChI InChI=1S/C22H20F3N3O3/c23-22(24,25)31-17-3-1-2-14(10-17)18-11-19-21(30)27-12-15(8-9-26)28(19)20(18)13-4-6-16(29)7-5-13/h1-7,10-11,15,29H,8-9,12,26H2,(H,27,30)/t15-/m0/s1
US Patent
n/an/a 1n/an/an/an/a7.5n/a
NERVIANO MEDICAL SCIENCES S.R.L.
US Patent
Assay Description
The inhibitory activity of putative kinase inhibitors and the potency of selected compounds were determined using a trans-phosphorylation assay. Spec...
US Patent US9181258 (2015)
BindingDB Entry DOI: 10.7270/Q2862F7F