BDBM191099 US9181258, 95
SMILES: CC(=O)c1ccc(cc1)-c1c(cc2C(=O)NC[C@H](CCN)n12)-c1cccc(OC(F)(F)F)c1
InChI Key: InChIKey=AQLVNFYJDCDILG-SFHVURJKSA-N
Data: 2 IC50
Activity Spreadsheet -- Enzyme Inhibition Constant Data from BindingDB
Found 2 hits for monomerid = 191099
Trg + Lig
Ki
nM
ΔG°
kcal/mole
IC50
nM
Kd
nM
EC50/IC50
nM
koff
s-1
kon
M-1s-1
pHTemp
°C
Serine/threonine-protein kinase pim-2
(Homo sapiens (Human))
BDBM191099
(US9181258, 95)
Show SMILES CC(=O)c1ccc(cc1)-c1c(cc2C(=O)NC[C@H](CCN)n12)-c1cccc(OC(F)(F)F)c1
Show InChI InChI=1S/C24H22F3N3O3/c1-14(31)15-5-7-16(8-6-15)22-20(17-3-2-4-19(11-17)33-24(25,26)27)12-21-23(32)29-13-18(9-10-28)30(21)22/h2-8,11-12,18H,9-10,13,28H2,1H3,(H,29,32)/t18-/m0/s1
US Patent
n/an/a 17n/an/an/an/a7.5n/a
NERVIANO MEDICAL SCIENCES S.R.L.
US Patent
Assay Description
The inhibitory activity of putative kinase inhibitors and the potency of selected compounds were determined using a trans-phosphorylation assay.Speci...
US Patent US9181258 (2015)
BindingDB Entry DOI: 10.7270/Q2862F7F
Serine/threonine-protein kinase pim-1
(Homo sapiens (Human))
BDBM191099
(US9181258, 95)
Show SMILES CC(=O)c1ccc(cc1)-c1c(cc2C(=O)NC[C@H](CCN)n12)-c1cccc(OC(F)(F)F)c1
Show InChI InChI=1S/C24H22F3N3O3/c1-14(31)15-5-7-16(8-6-15)22-20(17-3-2-4-19(11-17)33-24(25,26)27)12-21-23(32)29-13-18(9-10-28)30(21)22/h2-8,11-12,18H,9-10,13,28H2,1H3,(H,29,32)/t18-/m0/s1
US Patent
n/an/a 6n/an/an/an/a7.5n/a
NERVIANO MEDICAL SCIENCES S.R.L.
US Patent
Assay Description
The inhibitory activity of putative kinase inhibitors and the potency of selected compounds were determined using a trans-phosphorylation assay. Spec...
US Patent US9181258 (2015)
BindingDB Entry DOI: 10.7270/Q2862F7F