BDBM191107 US9181258, 104
SMILES: NCCC[C@H]1CNC(=O)c2cc(c(-c3ccc(O)cc3)n12)-c1cccc(OC(F)(F)F)c1
InChI Key: InChIKey=BFDYPWZGYIYZPW-INIZCTEOSA-N
Data: 2 IC50
Activity Spreadsheet -- Enzyme Inhibition Constant Data from BindingDB
Found 2 hits for monomerid = 191107
Trg + Lig
Ki
nM
ΔG°
kcal/mole
IC50
nM
Kd
nM
EC50/IC50
nM
koff
s-1
kon
M-1s-1
pHTemp
°C
Serine/threonine-protein kinase pim-2
(Homo sapiens (Human))
BDBM191107
(US9181258, 104)
Show SMILES NCCC[C@H]1CNC(=O)c2cc(c(-c3ccc(O)cc3)n12)-c1cccc(OC(F)(F)F)c1
Show InChI InChI=1S/C23H22F3N3O3/c24-23(25,26)32-18-5-1-3-15(11-18)19-12-20-22(31)28-13-16(4-2-10-27)29(20)21(19)14-6-8-17(30)9-7-14/h1,3,5-9,11-12,16,30H,2,4,10,13,27H2,(H,28,31)/t16-/m0/s1
US Patent
n/an/a 48n/an/an/an/a7.5n/a
NERVIANO MEDICAL SCIENCES S.R.L.
US Patent
Assay Description
The inhibitory activity of putative kinase inhibitors and the potency of selected compounds were determined using a trans-phosphorylation assay.Speci...
US Patent US9181258 (2015)
BindingDB Entry DOI: 10.7270/Q2862F7F
Serine/threonine-protein kinase pim-1
(Homo sapiens (Human))
BDBM191107
(US9181258, 104)
Show SMILES NCCC[C@H]1CNC(=O)c2cc(c(-c3ccc(O)cc3)n12)-c1cccc(OC(F)(F)F)c1
Show InChI InChI=1S/C23H22F3N3O3/c24-23(25,26)32-18-5-1-3-15(11-18)19-12-20-22(31)28-13-16(4-2-10-27)29(20)21(19)14-6-8-17(30)9-7-14/h1,3,5-9,11-12,16,30H,2,4,10,13,27H2,(H,28,31)/t16-/m0/s1
US Patent
n/an/a 4n/an/an/an/a7.5n/a
NERVIANO MEDICAL SCIENCES S.R.L.
US Patent
Assay Description
The inhibitory activity of putative kinase inhibitors and the potency of selected compounds were determined using a trans-phosphorylation assay. Spec...
US Patent US9181258 (2015)
BindingDB Entry DOI: 10.7270/Q2862F7F