BDBM191109 US9181258, 116
SMILES: COc1ccc(cc1)-c1c(cc2C(=O)NC[C@H](CCN)n12)-c1cccc(OC(F)(F)F)c1
InChI Key: InChIKey=TUKQVKODBBLMSY-INIZCTEOSA-N
Data: 2 IC50
Activity Spreadsheet -- Enzyme Inhibition Constant Data from BindingDB
Found 2 hits for monomerid = 191109
Trg + Lig
Ki
nM
ΔG°
kcal/mole
IC50
nM
Kd
nM
EC50/IC50
nM
koff
s-1
kon
M-1s-1
pHTemp
°C
Serine/threonine-protein kinase pim-2
(Homo sapiens (Human))
BDBM191109
(US9181258, 116)
Show SMILES COc1ccc(cc1)-c1c(cc2C(=O)NC[C@H](CCN)n12)-c1cccc(OC(F)(F)F)c1
Show InChI InChI=1S/C23H22F3N3O3/c1-31-17-7-5-14(6-8-17)21-19(15-3-2-4-18(11-15)32-23(24,25)26)12-20-22(30)28-13-16(9-10-27)29(20)21/h2-8,11-12,16H,9-10,13,27H2,1H3,(H,28,30)/t16-/m0/s1
US Patent
n/an/a 22n/an/an/an/a7.5n/a
NERVIANO MEDICAL SCIENCES S.R.L.
US Patent
Assay Description
The inhibitory activity of putative kinase inhibitors and the potency of selected compounds were determined using a trans-phosphorylation assay.Speci...
US Patent US9181258 (2015)
BindingDB Entry DOI: 10.7270/Q2862F7F
Serine/threonine-protein kinase pim-1
(Homo sapiens (Human))
BDBM191109
(US9181258, 116)
Show SMILES COc1ccc(cc1)-c1c(cc2C(=O)NC[C@H](CCN)n12)-c1cccc(OC(F)(F)F)c1
Show InChI InChI=1S/C23H22F3N3O3/c1-31-17-7-5-14(6-8-17)21-19(15-3-2-4-18(11-15)32-23(24,25)26)12-20-22(30)28-13-16(9-10-27)29(20)21/h2-8,11-12,16H,9-10,13,27H2,1H3,(H,28,30)/t16-/m0/s1
US Patent
n/an/a 3n/an/an/an/a7.5n/a
NERVIANO MEDICAL SCIENCES S.R.L.
US Patent
Assay Description
The inhibitory activity of putative kinase inhibitors and the potency of selected compounds were determined using a trans-phosphorylation assay. Spec...
US Patent US9181258 (2015)
BindingDB Entry DOI: 10.7270/Q2862F7F