BDBM191638 US9182402, 11
SMILES: COc1cccc(OCCOc2cccc(\C=c3/sc4nc5ccccc5n4c3=O)c2)c1
InChI Key: InChIKey=BWVLYKQGIYXBHV-HAHDFKILSA-N
Data: 3 IC50
Activity Spreadsheet -- Enzyme Inhibition Constant Data from BindingDB
Found 3 hits for monomerid = 191638
Trg + Lig
Ki
nM
ΔG°
kcal/mole
IC50
nM
Kd
nM
EC50/IC50
nM
koff
s-1
kon
M-1s-1
pHTemp
°C
Hepsin
(Homo sapiens (Human))
BDBM191638
(US9182402, 11)
Show SMILES COc1cccc(OCCOc2cccc(\C=c3/sc4nc5ccccc5n4c3=O)c2)c1
Show InChI InChI=1S/C25H20N2O4S/c1-29-18-7-5-9-20(16-18)31-13-12-30-19-8-4-6-17(14-19)15-23-24(28)27-22-11-3-2-10-21(22)26-25(27)32-23/h2-11,14-16H,12-13H2,1H3/b23-15-
US Patent
n/an/a 1.31E+3n/an/an/an/an/an/a
Fred Hutchinson Cancer Research Center
US Patent
Assay Description
To identify novel inhibitors of hepsin, the Chembridge DIVERSet 10,000 compound high-diversity library was screened using an assay based on the cleav...
US Patent US9182402 (2015)
BindingDB Entry DOI: 10.7270/Q23F4NF7
Thrombin
(Bos taurus (Bovine))
BDBM191638
(US9182402, 11)
Show SMILES COc1cccc(OCCOc2cccc(\C=c3/sc4nc5ccccc5n4c3=O)c2)c1
Show InChI InChI=1S/C25H20N2O4S/c1-29-18-7-5-9-20(16-18)31-13-12-30-19-8-4-6-17(14-19)15-23-24(28)27-22-11-3-2-10-21(22)26-25(27)32-23/h2-11,14-16H,12-13H2,1H3/b23-15-
US Patent
n/an/a>2.00E+4n/an/an/an/an/an/a
Fred Hutchinson Cancer Research Center
US Patent
Assay Description
To identify novel inhibitors of hepsin, the Chembridge DIVERSet 10,000 compound high-diversity library was screened using an assay based on the cleav...
US Patent US9182402 (2015)
BindingDB Entry DOI: 10.7270/Q23F4NF7
Trypsin
(Sus scrofa)
BDBM191638
(US9182402, 11)
Show SMILES COc1cccc(OCCOc2cccc(\C=c3/sc4nc5ccccc5n4c3=O)c2)c1
Show InChI InChI=1S/C25H20N2O4S/c1-29-18-7-5-9-20(16-18)31-13-12-30-19-8-4-6-17(14-19)15-23-24(28)27-22-11-3-2-10-21(22)26-25(27)32-23/h2-11,14-16H,12-13H2,1H3/b23-15-
US Patent
n/an/a 2.00E+3n/an/an/an/an/an/a
Fred Hutchinson Cancer Research Center
US Patent
Assay Description
To identify novel inhibitors of hepsin, the Chembridge DIVERSet 10,000 compound high-diversity library was screened using an assay based on the cleav...
US Patent US9182402 (2015)
BindingDB Entry DOI: 10.7270/Q23F4NF7