BDBM191774 US9187428, 2
SMILES: CNC(=O)c1cc(CSc2nc(N)c(C#N)c(-c3ccc(F)cc3)c2C#N)ccn1
InChI Key: InChIKey=BUPQTCPEJNYADY-UHFFFAOYSA-N
Data: 3 EC50
Activity Spreadsheet -- Enzyme Inhibition Constant Data from BindingDB
Found 3 hits for monomerid = 191774
Trg + Lig
Ki
nM
ΔG°
kcal/mole
IC50
nM
Kd
nM
EC50/IC50
nM
koff
s-1
kon
M-1s-1
pHTemp
°C
Adenosine receptor A1
(Homo sapiens (Human))
BDBM191774
(US9187428, 2)
Show SMILES CNC(=O)c1cc(CSc2nc(N)c(C#N)c(-c3ccc(F)cc3)c2C#N)ccn1
Show InChI InChI=1S/C21H15FN6OS/c1-26-20(29)17-8-12(6-7-27-17)11-30-21-16(10-24)18(15(9-23)19(25)28-21)13-2-4-14(22)5-3-13/h2-8H,11H2,1H3,(H2,25,28)(H,26,29)
Reactome pathway
US Patent
n/an/an/an/a 0.300n/an/a7.437
Bayer Intellectual Property GmbH
US Patent
Assay Description
The following test protocol is used for pharmacologically characterizing cells and for the robot-assisted substance screening:The stock cultures ar...
US Patent US9187428 (2015)
BindingDB Entry DOI: 10.7270/Q29Z93Q4
Adenosine receptor A2b
(Homo sapiens (Human))
BDBM191774
(US9187428, 2)
Show SMILES CNC(=O)c1cc(CSc2nc(N)c(C#N)c(-c3ccc(F)cc3)c2C#N)ccn1
Show InChI InChI=1S/C21H15FN6OS/c1-26-20(29)17-8-12(6-7-27-17)11-30-21-16(10-24)18(15(9-23)19(25)28-21)13-2-4-14(22)5-3-13/h2-8H,11H2,1H3,(H2,25,28)(H,26,29)
NCI pathway
Reactome pathway
US Patent
n/an/an/an/a 3.00E+3n/an/a7.437
Bayer Intellectual Property GmbH
US Patent
Assay Description
The following test protocol is used for pharmacologically characterizing cells and for the robot-assisted substance screening:The stock cultures ar...
US Patent US9187428 (2015)
BindingDB Entry DOI: 10.7270/Q29Z93Q4
Adenosine receptor A2a
(Homo sapiens (Human))
BDBM191774
(US9187428, 2)
Show SMILES CNC(=O)c1cc(CSc2nc(N)c(C#N)c(-c3ccc(F)cc3)c2C#N)ccn1
Show InChI InChI=1S/C21H15FN6OS/c1-26-20(29)17-8-12(6-7-27-17)11-30-21-16(10-24)18(15(9-23)19(25)28-21)13-2-4-14(22)5-3-13/h2-8H,11H2,1H3,(H2,25,28)(H,26,29)
NCI pathway
Reactome pathway
US Patent
n/an/an/an/a 3.00E+3n/an/a7.437
Bayer Intellectual Property GmbH
US Patent
Assay Description
The following test protocol is used for pharmacologically characterizing cells and for the robot-assisted substance screening:The stock cultures ar...
US Patent US9187428 (2015)
BindingDB Entry DOI: 10.7270/Q29Z93Q4