BDBM191818 US9187428, 46
SMILES: CNC(=O)c1cc(CSc2nc(N)c(C#N)c(-c3ccc(OS(=O)(=O)N(C)C)cc3)c2C#N)ccn1
InChI Key: InChIKey=XEHPYILEDAZGRI-UHFFFAOYSA-N
Data: 3 EC50
Activity Spreadsheet -- Enzyme Inhibition Constant Data from BindingDB
Found 3 hits for monomerid = 191818
Trg + Lig
Ki
nM
ΔG°
kcal/mole
IC50
nM
Kd
nM
EC50/IC50
nM
koff
s-1
kon
M-1s-1
pHTemp
°C
Adenosine receptor A1
(Homo sapiens (Human))
BDBM191818
(US9187428, 46)
Show SMILES CNC(=O)c1cc(CSc2nc(N)c(C#N)c(-c3ccc(OS(=O)(=O)N(C)C)cc3)c2C#N)ccn1
Show InChI InChI=1S/C23H21N7O4S2/c1-27-22(31)19-10-14(8-9-28-19)13-35-23-18(12-25)20(17(11-24)21(26)29-23)15-4-6-16(7-5-15)34-36(32,33)30(2)3/h4-10H,13H2,1-3H3,(H2,26,29)(H,27,31)
Reactome pathway
US Patent
n/an/an/an/a 0.0400n/an/a7.437
Bayer Intellectual Property GmbH
US Patent
Assay Description
The following test protocol is used for pharmacologically characterizing cells and for the robot-assisted substance screening:The stock cultures ar...
US Patent US9187428 (2015)
BindingDB Entry DOI: 10.7270/Q29Z93Q4
Adenosine receptor A2b
(Homo sapiens (Human))
BDBM191818
(US9187428, 46)
Show SMILES CNC(=O)c1cc(CSc2nc(N)c(C#N)c(-c3ccc(OS(=O)(=O)N(C)C)cc3)c2C#N)ccn1
Show InChI InChI=1S/C23H21N7O4S2/c1-27-22(31)19-10-14(8-9-28-19)13-35-23-18(12-25)20(17(11-24)21(26)29-23)15-4-6-16(7-5-15)34-36(32,33)30(2)3/h4-10H,13H2,1-3H3,(H2,26,29)(H,27,31)
NCI pathway
Reactome pathway
US Patent
n/an/an/an/a 425n/an/a7.437
Bayer Intellectual Property GmbH
US Patent
Assay Description
The following test protocol is used for pharmacologically characterizing cells and for the robot-assisted substance screening:The stock cultures ar...
US Patent US9187428 (2015)
BindingDB Entry DOI: 10.7270/Q29Z93Q4
Adenosine receptor A2a
(Homo sapiens (Human))
BDBM191818
(US9187428, 46)
Show SMILES CNC(=O)c1cc(CSc2nc(N)c(C#N)c(-c3ccc(OS(=O)(=O)N(C)C)cc3)c2C#N)ccn1
Show InChI InChI=1S/C23H21N7O4S2/c1-27-22(31)19-10-14(8-9-28-19)13-35-23-18(12-25)20(17(11-24)21(26)29-23)15-4-6-16(7-5-15)34-36(32,33)30(2)3/h4-10H,13H2,1-3H3,(H2,26,29)(H,27,31)
NCI pathway
Reactome pathway
US Patent
n/an/an/an/a 781n/an/a7.437
Bayer Intellectual Property GmbH
US Patent
Assay Description
The following test protocol is used for pharmacologically characterizing cells and for the robot-assisted substance screening:The stock cultures ar...
US Patent US9187428 (2015)
BindingDB Entry DOI: 10.7270/Q29Z93Q4